{"text_format":"1","workbook":"xlsx","n_sheets":3,"sheets":["Price List","Coding and Prices","Instructions"],"not_rendered":{"charts":0,"images":226,"macros":1,"external_links":0,"defined_names":3,"comments":0,"pivot_tables":0},"unopened":[],"bounds":{"document_bytes":16777216,"sheet_cells":100000,"rows_first":2000,"rows_last":500,"rows_between":2000,"halvings":0,"cell_chars":16384,"cell_head_chars":4096},"cells_cut":0,"cells_raw":0,"read":"whole","date_system":"1900"}

{"sheet":"Price List","index":0,"n_rows":1089,"n_cols":18,"rows_kept":1089,"cut":false,"hidden":false,"merged":[[460,16,461,16],[451,15,452,15],[494,17,495,17],[928,12,929,12],[928,13,929,13],[846,14,847,14],[849,10,850,10],[448,16,449,16],[433,11,434,11],[433,17,434,17],[457,17,458,17],[460,17,461,17],[463,17,464,17],[587,16,588,16],[578,9,579,9],[578,10,579,10],[578,11,579,11],[463,12,464,13],[491,14,492,14],[575,10,576,10],[515,9,516,9],[575,15,576,15],[575,17,576,17],[509,11,510,11],[463,9,464,9],[463,10,464,10],[575,13,576,13],[509,12,510,13],[515,15,516,15],[587,15,588,15],[460,11,461,11],[494,15,495,15],[494,16,495,16],[460,12,461,13],[460,14,461,14],[925,7,926,7],[925,13,926,13],[903,9,904,9],[903,10,904,10],[903,11,904,11],[903,12,904,12],[873,6,874,6],[873,7,874,7],[928,6,929,6],[928,7,929,7],[581,17,582,17],[587,14,588,14],[578,14,579,14],[578,15,579,15],[578,16,579,16],[578,17,579,17],[515,6,516,6],[599,17,600,17],[581,11,582,11],[629,10,630,10],[632,15,633,15],[928,10,929,10],[584,9,585,9],[632,6,633,6],[632,7,633,7],[632,8,633,8],[735,17,736,17],[626,17,627,17],[928,14,929,14],[928,15,929,15],[629,6,630,6],[928,11,929,11],[965,4,965,5],[982,4,982,5],[955,4,955,5],[956,4,956,5],[950,4,950,5],[951,4,951,5],[952,4,952,5],[953,4,953,5],[1012,1,1027,1],[1021,4,1021,5],[990,4,990,5],[855,14,856,14],[840,7,841,7],[843,13,844,13],[843,2,844,2],[843,5,844,5],[855,9,856,9],[855,10,856,10],[855,11,856,11],[977,4,977,5],[978,4,978,5],[979,4,979,5],[988,4,988,5],[855,3,856,3],[846,10,847,10],[870,11,871,11],[876,9,877,9],[876,11,877,11],[876,12,877,12],[876,13,877,13],[876,14,877,14],[925,6,926,6],[840,1,841,1],[840,2,841,2],[840,5,841,5],[859,1,860,1],[846,1,847,1],[855,1,856,1],[912,1,917,1],[919,1,923,1],[925,1,926,1],[903,2,904,2],[903,1,904,1],[857,1,857,5],[846,5,847,5],[852,1,853,1],[852,5,853,5],[903,3,904,3],[963,4,963,5],[943,1,958,1],[861,2,868,2],[928,1,929,1],[954,4,954,5],[873,2,874,2],[876,3,877,3],[878,1,878,5],[880,1,881,1],[909,1,910,1],[897,1,901,1],[873,1,874,1],[883,1,884,1],[961,4,961,5],[962,4,962,5],[1081,1,1081,5],[1066,1,1079,1],[1066,4,1066,5],[1067,4,1067,5],[1068,4,1068,5],[1069,4,1069,5],[1070,4,1070,5],[1071,4,1071,5],[1072,4,1072,5],[1073,4,1073,5],[1074,4,1074,5],[1075,4,1075,5],[1076,4,1076,5],[1077,4,1077,5],[1078,4,1078,5],[1079,4,1079,5],[1048,1,1061,1],[1065,4,1065,5],[1063,1,1063,17],[1052,4,1052,5],[1053,4,1053,5],[1054,4,1054,5],[873,17,874,17],[1030,1,1045,1],[1030,4,1030,5],[855,7,856,7],[855,8,856,8],[943,4,943,5],[944,4,944,5],[948,4,948,5],[843,9,844,9],[843,10,844,10],[843,1,844,1],[1049,4,1049,5],[1050,4,1050,5],[1051,4,1051,5],[1031,4,1031,5],[957,4,957,5],[930,1,930,5],[991,4,991,5],[1003,4,1003,5],[1002,4,1002,5],[1004,4,1004,5],[855,5,856,5],[964,4,964,5],[1034,4,1034,5],[1035,4,1035,5],[983,4,983,5],[977,1,992,1],[971,4,971,5],[972,4,972,5],[974,4,974,5],[989,4,989,5],[1005,4,1005,5],[846,6,847,6],[855,15,856,15],[855,17,856,17],[852,17,853,17],[846,17,847,17],[849,17,850,17],[846,7,847,7],[846,15,847,15],[855,16,856,16],[852,3,853,3],[852,16,853,16],[843,6,844,6],[1061,4,1061,5],[928,8,929,8],[928,9,929,9],[1041,4,1041,5],[1047,4,1047,5],[1048,4,1048,5],[1056,4,1056,5],[1057,4,1057,5],[1058,4,1058,5],[1059,4,1059,5],[1060,4,1060,5],[1055,4,1055,5],[984,4,984,5],[985,4,985,5],[986,4,986,5],[987,4,987,5],[949,4,949,5],[928,16,929,16],[928,17,929,17],[843,15,844,15],[771,14,772,14],[498,17,499,17],[765,3,766,3],[765,13,766,13],[759,3,760,3],[759,6,760,6],[812,15,813,15],[846,11,847,11],[846,13,847,13],[859,6,860,6],[859,7,860,7],[859,8,860,8],[859,9,860,9],[859,10,860,10],[859,11,860,11],[859,12,860,13],[859,14,860,14],[859,15,860,15],[859,16,860,16],[855,13,856,13],[849,9,850,9],[849,8,850,8],[818,6,819,6],[818,7,819,7],[818,8,819,8],[821,7,822,7],[821,8,822,8],[852,9,853,9],[855,6,856,6],[821,12,822,13],[821,6,822,6],[840,6,841,6],[410,16,411,16],[417,17,418,17],[371,16,372,16],[393,17,394,17],[150,1,151,1],[150,6,151,6],[198,1,199,1],[281,15,282,15],[195,2,196,2],[390,14,391,14],[299,14,300,14],[454,15,455,15],[296,12,297,12],[284,13,285,13],[281,13,282,13],[584,8,585,8],[590,9,591,9],[587,9,588,9],[581,9,582,9],[500,13,501,13],[500,11,501,11],[454,12,455,13],[515,16,516,16],[575,9,576,9],[466,17,467,17],[581,15,582,15],[421,11,422,11],[575,11,576,11],[500,10,501,10],[500,17,501,17],[498,8,499,8],[502,11,503,11],[840,15,841,15],[840,9,841,9],[840,10,841,10],[840,11,841,11],[840,13,841,13],[837,17,838,17],[840,16,841,16],[824,14,825,14],[818,9,819,9],[818,10,819,10],[818,11,819,11],[815,9,816,9],[833,14,834,14],[818,17,819,17],[833,13,834,13],[840,17,841,17],[824,16,825,16],[815,11,816,11],[840,14,841,14],[837,15,838,15],[815,10,816,10],[774,15,775,15],[738,15,739,15],[824,8,825,8],[812,14,813,14],[794,11,795,11],[794,12,795,13],[794,14,795,14],[812,8,813,8],[753,15,754,15],[762,8,763,8],[765,10,766,10],[765,15,766,15],[762,15,763,15],[759,15,760,15],[759,8,760,8],[741,14,742,14],[762,12,763,12],[747,14,748,14],[756,8,757,8],[756,9,757,9],[756,10,757,10],[815,8,816,8],[738,8,739,8],[780,12,781,12],[780,14,781,14],[780,15,781,15],[785,1,785,17],[786,2,786,3],[783,16,784,16],[780,16,781,16],[786,6,786,17],[765,17,766,17],[711,8,712,8],[806,17,807,17],[759,7,760,7],[626,1,627,1],[626,3,627,3],[629,1,630,1],[629,3,630,3],[629,5,630,5],[629,7,630,7],[629,8,630,8],[629,9,630,9],[732,1,733,1],[753,17,754,17],[774,14,775,14],[741,16,742,16],[593,16,594,16],[632,5,633,5],[629,11,630,11],[768,17,769,17],[768,8,769,8],[768,9,769,9],[768,10,769,10],[768,11,769,11],[768,12,769,12],[611,17,612,17],[738,1,739,1],[735,1,736,1],[762,17,763,17],[762,16,763,16],[762,13,763,13],[762,11,763,11],[708,3,709,3],[708,6,709,6],[720,9,721,9],[717,9,718,9],[714,10,715,10],[738,6,739,6],[735,2,736,2],[762,3,763,3],[726,6,727,6],[729,6,730,6],[694,15,695,15],[694,17,695,17],[717,17,718,17],[717,13,718,13],[717,11,718,11],[720,16,721,16],[717,6,718,6],[705,9,706,9],[720,6,721,6],[729,2,730,2],[708,12,709,13],[697,2,699,2],[729,12,730,12],[714,6,715,6],[714,7,715,7],[714,8,715,8],[714,9,715,9],[729,7,730,7],[714,17,715,17],[762,9,763,9],[705,12,706,12],[705,13,706,13],[694,6,695,6],[726,1,727,1],[705,6,706,6],[708,1,709,1],[711,3,712,3],[726,2,727,2],[701,1,703,1],[701,2,703,2],[685,8,686,8],[699,4,699,5],[717,1,718,1],[717,2,718,2],[691,7,692,7],[723,1,724,1],[705,2,706,2],[720,2,721,2],[694,3,695,3],[694,10,695,10],[697,1,699,1],[720,1,721,1],[723,2,724,2],[705,7,706,7],[714,1,715,1],[714,2,715,2],[702,4,702,5],[703,4,703,5],[685,1,686,1],[688,1,689,1],[714,3,715,3],[698,4,698,5],[691,2,692,2],[691,6,692,6],[708,7,709,7],[694,1,695,1],[660,1,661,1],[694,7,695,7],[666,7,667,7],[688,10,689,10],[688,9,689,9],[694,2,695,2],[688,3,689,3],[688,6,689,6],[691,1,692,1],[629,13,630,13],[632,9,633,9],[632,11,633,11],[578,7,579,7],[578,8,579,8],[685,6,686,6],[682,6,683,6],[675,1,676,1],[688,11,689,11],[691,11,692,11],[679,11,680,11],[679,9,680,9],[663,10,664,10],[666,10,667,10],[638,9,639,9],[623,11,624,11],[623,13,624,13],[620,8,621,8],[632,1,633,1],[632,3,633,3],[626,8,627,8],[626,9,627,9],[672,1,673,1],[657,1,658,1],[669,1,670,1],[651,1,652,1],[638,1,639,1],[623,1,624,1],[638,6,639,6],[654,1,655,1],[657,9,658,9],[657,6,658,6],[642,7,643,7],[660,15,661,15],[635,1,636,1],[679,1,680,1],[663,1,664,1],[663,6,664,6],[663,7,664,7],[666,1,667,1],[638,2,639,2],[666,2,667,2],[666,8,667,8],[672,6,673,6],[660,3,661,3],[651,8,652,8],[677,1,677,5],[669,6,670,6],[640,1,640,5],[679,14,680,14],[682,1,683,1],[685,3,686,3],[509,9,510,9],[611,10,612,10],[575,3,576,3],[590,13,591,13],[578,13,579,13],[632,13,633,13],[491,11,492,11],[705,1,706,1],[732,3,733,3],[723,6,724,6],[723,7,724,7],[723,8,724,8],[717,7,718,7],[717,8,718,8],[711,6,712,6],[711,7,712,7],[688,8,689,8],[726,8,727,8],[711,1,712,1],[711,2,712,2],[666,9,667,9],[708,8,709,8],[708,9,709,9],[694,12,695,13],[720,8,721,8],[720,7,721,7],[626,10,627,10],[626,11,627,11],[626,13,627,13],[596,13,597,13],[694,8,695,8],[669,2,670,2],[679,2,680,2],[502,13,503,13],[691,3,692,3],[682,3,683,3],[642,9,643,9],[688,7,689,7],[651,2,652,2],[669,3,670,3],[651,3,652,3],[675,8,676,8],[623,6,624,6],[648,6,649,6],[682,7,683,7],[654,6,655,6],[675,6,676,6],[635,5,636,5],[635,6,636,6],[578,3,579,3],[596,6,597,6],[605,11,606,11],[590,11,591,11],[638,7,639,7],[679,6,680,6],[679,7,680,7],[512,10,513,10],[654,7,655,7],[654,8,655,8],[660,7,661,7],[651,6,652,6],[660,6,661,6],[620,3,621,3],[617,6,618,6],[587,11,588,11],[605,13,606,13],[590,10,591,10],[620,11,621,11],[590,1,591,1],[614,1,615,1],[468,1,468,5],[491,1,492,1],[614,13,615,13],[614,7,615,7],[587,13,588,13],[617,5,618,5],[553,1,573,1],[575,8,576,8],[578,2,579,2],[498,13,499,13],[581,8,582,8],[587,2,588,2],[500,8,501,8],[620,10,621,10],[515,12,516,13],[581,13,582,13],[491,12,492,13],[614,6,615,6],[587,10,588,10],[512,11,513,11],[500,16,501,16],[357,12,358,13],[357,14,358,14],[454,16,455,16],[457,11,458,11],[515,8,516,8],[515,1,516,1],[457,7,458,7],[494,9,495,9],[491,7,492,7],[491,8,492,8],[515,11,516,11],[515,10,516,10],[463,16,464,16],[445,16,446,16],[466,15,467,15],[433,15,434,15],[448,15,449,15],[454,14,455,14],[357,15,358,15],[383,16,384,16],[390,15,391,15],[463,14,464,14],[494,11,495,11],[466,3,467,3],[491,6,492,6],[512,14,513,14],[502,16,503,16],[509,16,510,16],[491,15,492,15],[466,8,467,8],[509,6,510,6],[424,17,425,17],[419,17,420,17],[448,17,449,17],[354,17,355,17],[357,17,358,17],[451,16,452,16],[451,17,452,17],[451,14,452,14],[439,15,440,15],[421,15,422,15],[413,16,414,16],[502,10,503,10],[463,8,464,8],[512,1,513,1],[502,8,503,8],[498,10,499,10],[498,9,499,9],[502,6,503,6],[512,6,513,6],[502,7,503,7],[457,6,458,6],[509,8,510,8],[502,9,503,9],[500,9,501,9],[512,2,513,2],[474,4,474,5],[466,6,467,6],[494,7,495,7],[491,3,492,3],[410,13,411,13],[494,10,495,10],[498,6,499,6],[584,17,585,17],[599,14,600,14],[605,17,606,17],[602,16,603,16],[596,11,597,11],[584,16,585,16],[584,15,585,15],[599,9,600,9],[584,14,585,14],[688,17,689,17],[669,11,670,11],[614,16,615,16],[635,17,636,17],[645,17,646,17],[593,9,594,9],[648,10,649,10],[675,15,676,15],[593,10,594,10],[617,9,618,9],[651,16,652,16],[617,15,618,15],[590,17,591,17],[614,17,615,17],[602,14,603,14],[584,13,585,13],[590,16,591,16],[608,13,609,13],[651,17,652,17],[596,16,597,16],[669,14,670,14],[599,15,600,15],[651,12,652,13],[587,17,588,17],[599,13,600,13],[645,12,646,13],[623,7,624,7],[648,7,649,7],[596,9,597,9],[614,9,615,9],[651,7,652,7],[648,17,649,17],[617,7,618,7],[642,8,643,8],[611,16,612,16],[587,8,588,8],[596,7,597,7],[596,8,597,8],[614,15,615,15],[638,10,639,10],[651,10,652,10],[611,7,612,7],[593,15,594,15],[602,9,603,9],[642,14,643,14],[642,15,643,15],[638,13,639,13],[593,11,594,11],[642,6,643,6],[657,12,658,13],[614,14,615,14],[648,1,649,1],[648,2,649,2],[635,9,636,9],[602,11,603,11],[602,13,603,13],[620,15,621,15],[611,15,612,15],[596,14,597,14],[648,3,649,3],[635,10,636,10],[623,10,624,10],[648,11,649,11],[632,10,633,10],[626,5,627,5],[642,1,643,1],[648,9,649,9],[623,8,624,8],[611,8,612,8],[608,1,609,1],[605,1,606,1],[608,5,609,5],[611,1,612,1],[608,8,609,8],[638,5,639,5],[635,3,636,3],[645,15,646,15],[623,15,624,15],[620,7,621,7],[623,9,624,9],[623,3,624,3],[626,15,627,15],[660,16,661,16],[638,17,639,17],[688,12,689,13],[675,9,676,9],[679,10,680,10],[663,12,664,13],[660,11,661,11],[660,12,661,13],[660,17,661,17],[654,17,655,17],[679,15,680,15],[672,12,673,13],[657,11,658,11],[657,10,658,10],[685,16,686,16],[672,10,673,10],[672,11,673,11],[685,9,686,9],[623,5,624,5],[685,7,686,7],[682,9,683,9],[666,14,667,14],[669,12,670,13],[651,14,652,14],[682,8,683,8],[672,7,673,7],[672,8,673,8],[651,9,652,9],[654,14,655,14],[654,12,655,13],[648,16,649,16],[648,14,649,14],[608,17,609,17],[436,17,437,17],[415,17,416,17],[590,15,591,15],[502,17,503,17],[491,17,492,17],[442,15,443,15],[442,17,443,17],[515,17,516,17],[608,15,609,15],[575,14,576,14],[599,16,600,16],[620,17,621,17],[575,16,576,16],[620,16,621,16],[512,17,513,17],[502,15,503,15],[498,15,499,15],[512,15,513,15],[632,16,633,16],[626,14,627,14],[608,14,609,14],[645,14,646,14],[515,14,516,14],[500,14,501,14],[581,14,582,14],[427,17,428,17],[629,17,630,17],[638,14,639,14],[590,14,591,14],[602,5,603,5],[602,6,603,6],[602,7,603,7],[602,8,603,8],[608,7,609,7],[599,2,600,2],[599,6,600,6],[599,7,600,7],[614,8,615,8],[605,6,606,6],[605,7,606,7],[605,8,606,8],[611,4,611,5],[612,4,612,5],[605,5,606,5],[602,2,603,2],[611,6,612,6],[602,1,603,1],[608,6,609,6],[614,5,615,5],[623,2,624,2],[617,1,618,1],[620,5,621,5],[620,6,621,6],[620,1,621,1],[626,6,627,6],[626,7,627,7],[638,8,639,8],[454,2,455,2],[519,1,551,1],[596,1,597,1],[581,6,582,6],[599,8,600,8],[593,7,594,7],[575,6,576,6],[575,7,576,7],[587,1,588,1],[590,2,591,2],[590,6,591,6],[590,7,591,7],[590,8,591,8],[587,7,588,7],[599,1,600,1],[599,5,600,5],[593,6,594,6],[593,8,594,8],[584,1,585,1],[578,1,579,1],[584,6,585,6],[581,1,582,1],[581,7,582,7],[593,1,594,1],[578,5,579,5],[466,7,467,7],[578,6,579,6],[575,1,576,1],[584,7,585,7],[500,2,501,2],[500,7,501,7],[509,2,510,2],[500,6,501,6],[500,4,501,5],[498,2,499,2],[502,2,503,2],[491,10,492,10],[509,7,510,7],[498,7,499,7],[509,1,510,1],[480,2,481,2],[478,2,479,2],[466,2,467,2],[466,9,467,9],[470,1,489,1],[587,6,588,6],[515,7,516,7],[512,7,513,7],[497,1,507,1],[463,3,464,3],[460,10,461,10],[466,1,467,1],[442,6,443,6],[494,8,495,8],[448,1,449,1],[454,8,455,8],[454,9,455,9],[454,6,455,6],[454,7,455,7],[454,1,455,1],[451,1,452,1],[445,1,446,1],[445,6,446,6],[445,7,446,7],[473,4,473,5],[445,2,446,2],[466,10,467,10],[442,1,443,1],[457,3,458,3],[448,9,449,9],[445,10,446,10],[448,10,449,10],[445,8,446,8],[448,8,449,8],[390,6,391,6],[341,6,342,6],[363,7,364,7],[380,7,381,7],[386,6,387,6],[371,7,372,7],[338,6,339,6],[439,6,440,6],[433,3,434,3],[460,7,461,7],[494,1,495,1],[442,8,443,10],[460,8,461,8],[491,9,492,9],[457,1,458,1],[457,2,458,2],[494,3,495,3],[494,6,495,6],[460,1,461,1],[472,4,472,5],[460,2,461,2],[460,6,461,6],[463,1,464,1],[463,2,464,2],[463,6,464,6],[463,7,464,7],[448,2,449,2],[439,9,440,9],[436,10,437,10],[471,4,471,5],[451,2,452,2],[451,6,452,6],[383,7,384,7],[421,7,422,7],[393,2,394,2],[383,6,384,6],[344,1,345,1],[344,7,345,7],[354,1,355,1],[436,15,437,15],[424,15,425,15],[419,9,420,9],[415,11,416,11],[413,13,414,13],[419,16,420,16],[421,16,422,16],[415,16,416,16],[417,16,418,16],[436,16,437,16],[430,15,431,15],[371,14,372,14],[371,12,372,13],[399,10,400,10],[399,14,400,14],[399,11,400,11],[344,16,345,16],[347,16,348,16],[399,16,400,16],[413,15,414,15],[427,15,428,15],[430,14,431,14],[433,14,434,14],[393,14,394,14],[396,15,397,15],[417,2,418,2],[433,1,434,1],[430,2,431,2],[430,1,431,1],[427,1,428,1],[421,3,422,3],[433,2,434,2],[413,7,414,7],[417,13,418,13],[421,13,422,13],[433,12,434,13],[436,12,437,13],[415,13,416,13],[430,12,431,12],[430,13,431,13],[436,8,437,8],[427,12,428,13],[424,7,425,7],[415,8,416,8],[430,11,431,11],[433,9,434,9],[433,10,434,10],[419,2,420,2],[419,6,420,6],[413,3,414,3],[415,2,416,2],[407,3,407,4],[402,2,402,3],[386,9,387,9],[451,8,452,8],[419,8,420,8],[439,8,440,8],[451,9,452,9],[451,10,452,10],[413,1,422,1],[448,6,449,6]],"merged_total":3261,"flags":["merged_cut"]}
[]
[]
[]
[]
[]
[]
[]
[]
[]
[]
[null,"How to order?",null,"Name (First and last):"]
[null,"Fill out this form, save it to your computer and email back to sales@detectablematerials.com",null,"Date:"]
[null,null,null,"Store#:"]
[null,null,null,"Number#:"]
[]
[null,"Stationary Range"]
[null,"DETECTAMET PEN RANGE\nElephant Pens \nHD Pens\nOne Piece Pens\nEconomy Pen\nPen Refills\nMetal Case Pens\nTouch Screen Pen\nStylus\n\n\n","Marker & Highlighter Pen Range\nMarker Pen Range\nRetractable - Whiteboard Marker \nRetractable - Permanent Marker\nNon Retractable - Whiteboard Marker\nNon Retractable - Permanent Marker\nFine Tip Marker Pen\n\nHighlighter Pen Range\nRetractable - Chisel Tip Highlighter \nNon Retractable - Chisel Tip Highlighter\n",null,"Detectable Clipboard Range\nClipboard Range\nColour Coded Clipboard Range\nRing Binder Clipboards",null,"Office Equipment\nCalculators                                       Paperclip\nStapless Stapler                             Scissors\nID Badge Holder                             Ruler\nLanyards                                            Split Ring/Safety Chain\nGrip Pen Sleeve                             Document Fastener\nPen Holder                                       Whiteboard Film\nMetal Detectable Paper             Paper Holder\n"]
[]
[]
[null,"Create Your Own - These options are customisable and will create your code and purchase price for you",null,null,null,null,null,null,null,null,null,null,null,null,"Unit Per Pack","Running Total",{"$f":"SUM(R20:R927)","v":0}]
[]
[null,null,null,null,null,null,"Product Code",null,null,null,null,null,null,null,null,"Quantity","Price","Total"]
[null,"Retractable Pen Type","Ink","Housing","End Cap","Attachment"]
[null,"HD Retractable","Blue","Blue Housing","Blue End","With Clip",101,"-",{"$f":"HLOOKUP(C24,'Coding and Prices'!D1:N3,3,0)","v":"I01"},"-",{"$f":"HLOOKUP(D24,'Coding and Prices'!P1:X4,4,0)","v":"C1"},{"$f":"HLOOKUP(E24,'Coding and Prices'!Y1:AG5,5,0)","v":1},"-",{"$f":"HLOOKUP(F24,'Coding and Prices'!AH1:AJ6,6,0)","v":"PA01"},50,null,{"$f":"((INDEX('Coding and Prices'!A8:M10, MATCH(B24,'Coding and Prices'!A8:A10,0), MATCH(C24,'Coding and Prices'!A8:M8,0))))*1.06","v":72.61},{"$f":"Q24*P24","v":0}]
[null,"Elephant Retractable","Blue","Blue Housing","Blue End","With Clip",104,"-",{"$f":"HLOOKUP(C25,'Coding and Prices'!D1:N3,3,0)","v":"I01"},"-",{"$f":"HLOOKUP(D25,'Coding and Prices'!P1:X4,4,0)","v":"C1"},{"$f":"HLOOKUP(E25,'Coding and Prices'!Y1:AG5,5,0)","v":1},"-",{"$f":"HLOOKUP(F25,'Coding and Prices'!AH1:AJ6,6,0)","v":"PA01"},50,null,{"$f":"((INDEX('Coding and Prices'!A8:M10, MATCH(B25,'Coding and Prices'!A8:A10,0), MATCH(C25,'Coding and Prices'!A8:M8,0))))*1.06","v":64.66},0]
[]
[null,"Stick Pen Type","Ink","Housing","Attachment"]
[null,"HD Stick","Blue","Blue Housing","With Clip",null,106,"-",{"$f":"HLOOKUP(C28,'Coding and Prices'!A12:G14,3,0)","v":"I01"},"-",{"$f":"HLOOKUP(D28,'Coding and Prices'!A12:P15,4,0)","v":"C101"},null,"-",{"$f":"HLOOKUP(E28,'Coding and Prices'!A12:S16,5,0)","v":"PA01"},50,null,{"$f":"((VLOOKUP(B28,'Coding and Prices'!A18:B20,2,0)))*1.06","v":42.400000000000006},{"$f":"Q28*P28","v":0}]
[null,"Elephant Stick","Blue","Blue Housing","With Clip",null,{"$f":"INDEX('Coding and Prices'!A12:S16, MATCH(B27,'Coding and Prices'!A12:A16,0), MATCH(B29,'Coding and Prices'!A12:S12,0))","v":105},"-",{"$f":"INDEX('Coding and Prices'!A12:S16, MATCH(D27,'Coding and Prices'!A12:A16,0), MATCH(D29,'Coding and Prices'!A12:S12,0))","v":"C101"},"-",{"$f":"INDEX('Coding and Prices'!A12:S16, MATCH(C27,'Coding and Prices'!A12:A16,0), MATCH(C29,'Coding and Prices'!A12:S12,0))","v":"I01"},null,"-",{"$f":"INDEX('Coding and Prices'!A12:S16, MATCH(E27,'Coding and Prices'!A12:A16,0), MATCH(E29,'Coding and Prices'!A12:S12,0))","v":"PA01"},50,null,{"$f":"((VLOOKUP(B29,'Coding and Prices'!A19:B20,2,0)))*1.06","v":37.1},{"$f":"Q29*P29","v":0}]
[]
[null,"Metal Case Pen","Ink","Attachment",null,null,null,"115M",null,"-",{"$f":"HLOOKUP(C32,'Coding and Prices'!A22:P23,2,0)","v":"I01"},"-",{"$f":"HLOOKUP(D32,'Coding and Prices'!B22:P24,3,0)","v":"PA05"},null,50,null,{"$f":"((INDEX('Coding and Prices'!A26:M29, MATCH(D32,'Coding and Prices'!A26:A29,0), MATCH(C32,'Coding and Prices'!A26:M26,0))))*1.06","v":95.93},{"$f":"P31*Q31","v":0}]
[null,null,"Blue","Standard (No Clip)"]
[]
[null,"Stainless Steel Pen Type","Ink",null,null,null,null,null,{"$f":"HLOOKUP(B35,'Coding and Prices'!A31:C33,2,0)","v":113},"-","A05","-",{"$f":"HLOOKUP(C35,'Coding and Prices'!A31:O33,3,0)","v":"I01"},null,10,null,{"$f":"((INDEX('Coding and Prices'!A35:M37, MATCH(B35,'Coding and Prices'!A35:A37,0), MATCH(C35,'Coding and Prices'!A35:M35,0)))*1.85)*1.06","v":39.22},{"$f":"P34*Q34","v":0}]
[null,"Stainless Steel Managers Pen","Blue"]
[]
[null,"SP Stick Pen","Ink",null,null,null,null,null,119,"-",{"$f":"HLOOKUP(C38,'Coding and Prices'!D18:H19,2,0)","v":"I01"},"-","PA02",null,100,null,93.28,{"$f":"P37*Q37","v":0}]
[null,null,"Blue"]
[]
[null,"Economy Retractable Pen","Ink",null,null,null,null,null,125,"-","PA01","-",{"$f":"HLOOKUP(C41,'Coding and Prices'!D18:H19,2,0)","v":"I01"},null,50,null,44.122500000000002,{"$f":"P40*Q40","v":0}]
[null,null,"Blue"]
[]
[null,"Pen Refill Type (Suitable for HD , Elephant & Metal case pens)","Colour"]
[null,"Standard Ink","Blue",null,null,null,null,null,100,"-",{"$f":"HLOOKUP(C44,'Coding and Prices'!E184:H186,3,0)","v":"I01"},null,null,null,50,null,39.22,{"$f":"Q44*P44","v":0}]
[null,"Gel Ink","Blue",null,null,null,null,null,100,"-",{"$f":"HLOOKUP(C45,'Coding and Prices'!A188:E189,2,0)","v":"I21"},null,null,null,50,null,63.6,0]
[null,"Cryo Ink","Blue",null,null,null,null,null,100,"-",{"$f":"HLOOKUP(C46,'Coding and Prices'!A188:E190,3,0)","v":"I11"},null,null,null,50,null,100.17,0]
[null,"Fine Tip Ink","Blue",null,null,null,null,null,100,"-",{"$f":"HLOOKUP(C47,'Coding and Prices'!A188:E191,4,0)","v":"I31"},null,null,null,50,null,63.6,0]
[null,"Economy Ink","Blue",null,null,null,null,null,124,"-",{"$f":"HLOOKUP(C48,'Coding and Prices'!A188:E192,5,0)","v":"I01"},null,null,null,50,null,10.600000000000001,0]
[null,"Stick Pen Ink","Blue",null,null,null,null,null,117,"-",{"$f":"HLOOKUP(C49,'Coding and Prices'!A188:E192,5,0)","v":"I01"},null,null,null,50,null,31.8,0]
[]
[null,"Stylus ","Blue",null,null,null,null,null,122,"-","A65",null,null,null,10,null,31.376000000000005,{"$f":"Q51*P51","v":0}]
[]
[]
[null,"Touch Screen Pen","2 in 1 ","Blue","Blue Ink",null,121,"-","T202","-","C101","-",null,"I01",10,null,112.78400000000001,{"$f":"Q54*P54","v":0}]
[]
[]
[null,"Easygrip Pen Sleeve","Type","Blue",null,null,null,null,123,"-","P01","-",null,{"$f":"HLOOKUP(C58,'Coding and Prices'!A300:C301,2,0)","v":"S060"},10,null,20.14,{"$f":"Q57*P57","v":0}]
[null,null,"Single Pen Sleeve"]
[]
[null,"Detectable Mechanical Pencil","Metal Case","0.5mm 2B",null,null,null,null,131,"-","C100","-",null,"I50",10,null,21.73,{"$f":"Q60*P60","v":0}]
[]
[]
[null,"Mechanical Pencil Refills","Spare Pencil Leads","0.5mm 2B",null,null,null,null,"131B","-","T201","-",null,"I50",10,null,1.06,{"$f":"Q63*P63","v":0}]
[]
[null,"Marker & Highlighter Pen Range"]
[]
[null,"Marker Pen Type","Ink","Retractable?","Tip Type",null,{"$f":"INDEX('Coding and Prices'!A39:K43, MATCH(B67,'Coding and Prices'!A39:A43,0), MATCH(B68,'Coding and Prices'!A39:K39,0))","v":146},"-",{"$f":"INDEX('Coding and Prices'!A39:K43, MATCH(D67,'Coding and Prices'!A39:A43,0), MATCH(D68,'Coding and Prices'!A39:K39,0))","v":"A05"},"-",{"$f":"INDEX('Coding and Prices'!A39:K43, MATCH(C67,'Coding and Prices'!A39:A43,0), MATCH(C68,'Coding and Prices'!A39:K39,0))","v":"P01"},"-",{"$f":"INDEX('Coding and Prices'!A39:K43, MATCH(E67,'Coding and Prices'!A39:A43,0), MATCH(E68,'Coding and Prices'!A39:K39,0))","v":"A07"},null,10,null,{"$f":"((VLOOKUP(D68,'Coding and Prices'!A45:B47,2,0))*1.85)*1.06","v":29.807200000000002},{"$f":"P67*Q67","v":0}]
[null,"Permanent Marker","Blue","Retractable","Bullet Tip"]
[]
[null,"Fine Permanent Marker","Ink",null,null,null,null,null,147,"-","A06","-",{"$f":"HLOOKUP(C71,'Coding and Prices'!A39:I43,4,0)","v":"P01"},null,10,null,25.6891,{"$f":"P70*Q70","v":0}]
[null,null,"Blue"]
[]
[null,"Food/Meat Marker","Marker Type","Ink",null,null,null,null,148,"-",{"$f":"HLOOKUP(C74,'Coding and Prices'!J18:N20,2,0)","v":"T041"},"-",{"$f":"HLOOKUP(D74,'Coding and Prices'!J18:N20,3,0)","v":"P01"},null,10,null,34.317500000000003,{"$f":"P73*Q73","v":0}]
[null,null,"Meat Marker","Blue"]
[]
[null,"Highlighter","Ink","Retractable?","Tip Type",null,150,"-",{"$f":"INDEX('Coding and Prices'!A55:H58, MATCH(D76,'Coding and Prices'!A55:A58,0), MATCH(D77,'Coding and Prices'!A55:H55,0))","v":"A05"},"-",{"$f":"INDEX('Coding and Prices'!A55:H58, MATCH(C76,'Coding and Prices'!A55:A58,0), MATCH(C77,'Coding and Prices'!A55:H55,0))","v":"P04"},"-","A08",null,5,null,{"$f":"((VLOOKUP(D77,'Coding and Prices'!A49:B51,2,0))*1.85)*1.06","v":12.251347500000001},{"$f":"P76*Q76","v":0}]
[null,null,"Green","Retractable","Chisel Tip"]
[]
[null,"Assorted Retractable Highlighters","5 Colour Pack","Pink, Blue, Yellow, Orange & Green",null,null,null,null,150,"-","T154",null,null,null,5,null,12.550400000000002,{"$f":"P79*Q79","v":0}]
[]
[]
[null,"Assorted Non Retractable Highlighters","5 Colour Pack","Pink, Blue, Yellow, Orange & Green",null,null,null,null,150,"-","A06","-",null,"T154",5,null,11.569900000000002,{"$f":"P82*Q82","v":0}]
[]
[]
[null,"Retractable Highlighter Refills","Colour",null,null,null,null,null,156,"-",{"$f":"HLOOKUP(C86,'Coding and Prices'!A1087:F1088,2,0)","v":"P01"},"-",null,"A08",5,null,5.8830000000000009,{"$f":"P85*Q85","v":0}]
[null,null,"Blue"]
[]
[null,"Assorted Retractable Highlighter Refills","5 Colour Pack","Pink, Blue, Yellow, Orange & Green",null,null,null,null,150,"-","ASSORTED",null,null,null,5,null,5.8830000000000009,{"$f":"P88*Q88","v":0}]
[]
[null,"Detectable Plastic Clipboard Range"]
[]
[null,"Detectable Plastic Clipboard","Size/Orientation","Colour/Material",null,"Attachment",300,"-",{"$f":"INDEX('Coding and Prices'!A60:AC64, MATCH(C92,'Coding and Prices'!A60:A64,0), MATCH(C93,'Coding and Prices'!A60:AC60,0))","v":"O21"},"-",{"$f":"INDEX('Coding and Prices'!A60:AC64, MATCH(D92,'Coding and Prices'!A60:A64,0), MATCH(D93,'Coding and Prices'!A60:AC60,0))","v":"P03"},"-",{"$f":"INDEX('Coding and Prices'!A60:AC64, MATCH(F92,'Coding and Prices'!A60:A64,0), MATCH(F93,'Coding and Prices'!A60:AC60,0))","v":"A12"},null,1,null,{"$f":"((INDEX('Coding and Prices'!A66:N72, MATCH(C93,'Coding and Prices'!A66:A72,0), MATCH(F93,'Coding and Prices'!A66:N66,0)))*1.85)*1.06","v":10.801188},{"$f":"P92*Q92","v":0}]
[null,null,"A5 Landscape","Red",null,"Economy Chrome Plated"]
[]
[null,"Magentic Detectable Plastic Clipboard","Size/Orientation","Colour/Material",null,"Attachment",301,"-",{"$f":"HLOOKUP(C96,'Coding and Prices'!A990:G992,3,0)","v":"O06"},"-",{"$f":"HLOOKUP(D96,'Coding and Prices'!A990:P994,4,0)","v":"P01"},"-",{"$f":"HLOOKUP(F96,'Coding and Prices'!A990:T994,5,0)","v":"A10"},null,1,null,{"$f":"((INDEX('Coding and Prices'!A996:E1002,MATCH('Price List'!C96,'Coding and Prices'!A996:A1002,0),MATCH('Price List'!F96,'Coding and Prices'!A996:E996,0)))*1.85)*1.06","v":26.898770304000006},{"$f":"P95*Q95","v":0}]
[null,null,"A4 Portrait","Blue",null,"HD St/St Clip"]
[]
[null,"Ring Binder Clipboards","Size/Orientation","Colour",null,"Attachment"]
[null,null,"A3 Landscape","Blue",null,"2 Ring",300,"-","O04","-",{"$f":"HLOOKUP(D99,'Coding and Prices'!A1011:J1012,2,0)","v":"P01"},"-",null,{"$f":"HLOOKUP(F99,'Coding and Prices'!A1011:L1013,3,0)","v":"A138"},1,null,{"$f":"((HLOOKUP(F99,'Coding and Prices'!A1015:C1016,2,0))*1.85)*1.06","v":44.007852096000001},{"$f":"Q99*P99","v":0}]
[null,null,"A4 Portrait","Blue",null,"2 Ring",300,"-","O06","-",{"$f":"HLOOKUP(D100,'Coding and Prices'!A1011:J1012,2,0)","v":"P01"},"-",null,"A138",1,null,15.707610000000001,{"$f":"Q100*P100","v":0}]
[null,null,"A4 Landscape","Blue",null,"4 Ring",300,"-","O05","-",{"$f":"HLOOKUP(D101,'Coding and Prices'!A1011:J1012,2,0)","v":"P01"},"-",null,"A139",1,null,16.295910000000003,{"$f":"Q101*P101","v":0}]
[]
[]
[null,"Magnetic Ring Binder Clipboards","Size/Orientation","Colour",null,"Attachment"]
[null,null,"A3 Landscape","Blue",null,"2 Ring",300,"-","O04","-",{"$f":"HLOOKUP(D105,'Coding and Prices'!A1011:J1012,2,0)","v":"P01"},"-",null,{"$f":"HLOOKUP(F105,'Coding and Prices'!K1011:L1013,3,0)","v":"A138"},1,null,{"$f":"(((HLOOKUP(F105,'Coding and Prices'!A1024:C1025,2,0))*1.08)*1.85)*1.06","v":58.284057600000011},{"$f":"Q105*P105","v":0}]
[null,null,"A4 Portrait","Blue",null,"2 Ring",300,"-","O06","-",{"$f":"HLOOKUP(D106,'Coding and Prices'!A1011:J1012,2,0)","v":"P01"},"-",null,"A138",1,null,25.456917600000004,{"$f":"Q106*P106","v":0}]
[null,null,"A4 Landscape","Blue",null,"4 Ring",300,"-","O05","-",{"$f":"HLOOKUP(D107,'Coding and Prices'!A1011:J1012,2,0)","v":"P01"},"-",null,"A139",1,null,26.134639200000006,{"$f":"Q107*P107","v":0}]
[]
[null,"Office Equipment"]
[]
[null,"Solar Powered Fully Detectable Calculators","Handheld","Attachment",null,null,null,null,202,{"$f":"HLOOKUP(D112,'Coding and Prices'!A819:C820,2,0)","v":"C"},"-",null,"P01",null,1,null,{"$f":"(HLOOKUP(D112,'Coding and Prices'!A822:C823,2,0))*1.06","v":21.7088},{"$f":"Q111*P111","v":0}]
[null,null,null,"With safety chain"]
[]
[null,"Detectable Calculators","Type",null,null,null,null,null,202,{"$f":"HLOOKUP(C115,'Coding and Prices'!A209:D210,2,0)","v":"D"},"-",null,"P01",null,1,null,{"$f":"((HLOOKUP(C115,'Coding and Prices'!B212:D213,2,0))*1.85)*1.06","v":34.394371200000009},{"$f":"Q114*P114","v":0}]
[null,null,"Desktop"]
[]
[null,"Detectable Calculators Holders","Magnetic status","Type","Colour",null,null,null,{"$f":"HLOOKUP(C118,'Coding and Prices'!A198:C199,2,0)","v":214},{"$f":"HLOOKUP(D118,'Coding and Prices'!A198:F200,3,0)","v":"P"},"-",null,{"$f":"HLOOKUP(E118,'Coding and Prices'!A198:O201,4,0)","v":"P02"},null,1,null,{"$f":"((INDEX('Coding and Prices'!A203:D205,MATCH(C118,'Coding and Prices'!A203:A205,0),MATCH(D118,'Coding and Prices'!A203:D203,0)))*1.85)*1.06","v":12.601386000000003},{"$f":"Q117*P117","v":0}]
[null,null,"Magnetic","Pocket","Black"]
[]
[null,"Detectable Stopwatch","Blue","Complete with Safety Chain",null,null,201,"-","A65","-","P01","-",null,"A55",1,null,22.004773200000002,{"$f":"Q120*P120","v":0}]
[]
[]
[null,"Detectable Process Timer","Blue",null,null,null,null,null,215,"-","P01",null,null,null,1,null,22.004773200000002,{"$f":"Q123*P123","v":0}]
[]
[null,"Detectable Plastic Ruler","Type","Blue",null,null,204,"-","P01","-",{"$f":"HLOOKUP(C126,'Coding and Prices'!A217:C218,2,0)","v":"S069"},"-",null,"X27",5,null,{"$f":"((HLOOKUP(C126,'Coding and Prices'!A220:C221,2,0))*1.85)*1.06","v":8.0479440000000011},{"$f":"Q125*P125","v":0}]
[null,null,"150mm (6\")"]
[null,"Stainless Steel Rulers","Type",null,null,null,208,"-","P32","-",{"$f":"HLOOKUP(C128,'Coding and Prices'!A225:D226,2,0)","v":"S069"},"-",null,"X27",1,null,{"$f":"((HLOOKUP(C128,'Coding and Prices'!A228:D229,2,0))*1.85)*1.06","v":1.3130856000000004},{"$f":"Q127*P127","v":0}]
[null,null,"150mm (6\")"]
[]
[null,"Scissors","(216mm) 8½\"","ST/ST Blade",null,null,206,"-","S237","-","P01","-",null,"Q01",1,null,12.114273600000002,{"$f":"Q130*P130","v":0}]
[]
[]
[null,"Scissors","(216mm) 8½\"","ST/ST Blade",null,null,219,"-","P01","-","S237","-",null,"Q03",1,null,15.589950000000002,{"$f":"Q133*P133","v":0}]
[]
[]
[null,"Scissors / Knife Holder","Colour",null,null,null,null,null,218,"-",{"$f":"HLOOKUP(C137,'Coding and Prices'!A980:J981,2,0)","v":"P01"},null,null,null,5,null,44.122500000000002,{"$f":"Q136*P136","v":0}]
[null,null,"Blue"]
[]
[null,"Non Detectable - Stapless Stapler \n(HD Version - Up to 8 Sheets)","Colour",null,null,null,207,"-","A66","-","T145","-",null,{"$f":"HLOOKUP(C140,'Coding and Prices'!A307:F308,2,0)","v":"P012"},1,null,{"$f":"((HLOOKUP(C140,'Coding and Prices'!A310:F311,2,0))*1.85)*1.06","v":19.717462800000007},{"$f":"Q139*P139","v":0}]
[null,null,"Light Blue"]
[]
[null,"Non Detectable - Stapless Stapler \n(MD Version - Up to 6 Sheets)","Colour",null,null,null,207,"-","A66","-","T146","-",null,{"$f":"HLOOKUP(C143,'Coding and Prices'!A313:F314,2,0)","v":"P13"},1,null,{"$f":"((HLOOKUP(C143,'Coding and Prices'!A316:F317,2,0))*1.85)*1.06","v":13.109677200000004},{"$f":"Q142*P142","v":0}]
[null,null,"Light Green"]
[]
[null,"Detectable Stapless Stapler","Blue",null,null,null,207,"-","A65","-","T184","-",null,"P01",5,null,49.452498000000013,{"$f":"Q145*P145","v":0}]
[]
[]
[null,"Non Detectable Paper Crimper\n(5 Sheet Capacity)","Blue",null,null,null,207,"-","A66","-","T302","-",null,"P01",1,null,29.415000000000003,{"$f":"Q148*P148","v":0}]
[]
[]
[null,"Marker Pen and Eraser Holder","Type",null,null,null,null,null,319,"-","P01","-",null,{"$f":"HLOOKUP(C152,'Coding and Prices'!A666:C667,2,0)","v":"A10"},1,null,{"$f":"((HLOOKUP(C152,'Coding and Prices'!A669:C670,2,0))*1.85)*1.06","v":23.788028160000003},{"$f":"Q151*P151","v":0}]
[null,null,"With ST/ST Clip"]
[null,null,null,null,null,null,null,null,null,null,null,null,null,null,null,null,"UNIT PRICE"]
[null,"Pen Springs\n(Stainless Steel)","Quantity",null,null,null,null,null,151,"-","P32",null,null,null,1,null,{"$f":"((HLOOKUP(C155,'Coding and Prices'!A672:F673,2,0))*1.85)*1.06","v":0.20585793600000002},{"$f":"Q154*P154","v":0}]
[null,null,"5000+ pcs"]
[]
[null,"Safety chain with st/st clasp","762mm (30\") 2.4mm diameter ",null,null,null,154,"-","P44","-","S083","-",null,"A93",10,null,18.637344000000006,{"$f":"Q157*P157","v":0}]
[]
[]
[null,"Connection Clasp \n(St/St)","To use with stainless steel chain",null,null,null,null,null,152,"-","P32",null,null,null,50,null,3.1376000000000004,{"$f":"Q160*P160","v":0}]
[]
[]
[null,"Split Rings\n(St/St)","Connects chain to pens",null,null,null,null,null,153,"-","T203",null,null,null,10,null,2.1571000000000002,{"$f":"Q163*P163","v":0}]
[]
[]
[null,"Keyboard Station","Blue",null,null,null,null,null,509,"-","P01",null,null,null,1,null,21.920058000000001,{"$f":"Q166*P166","v":0}]
[]
[]
[null,"Mouse Mat","210 x 160 x 3mm (8.3 x 6.3 x 0.1\")",null,null,null,203,"-","A65","-","P01","-",null,"S232",1,null,20.268111600000005,{"$f":"Q169*P169","v":0}]
[]
[]
[null,"Retractable Badge/ID Reel","Nylon Cord",null,null,null,null,null,217,"-","A65",null,null,null,4,null,23.139800000000005,{"$f":"Q172*P172","v":0}]
[]
[]
[null,"Swipe Card Holders","Attachment","Colours",null,null,212,"-","A65","-",{"$f":"HLOOKUP(C176,'Coding and Prices'!A983:C984,2,0)","v":"A55"},"-",null,{"$f":"HLOOKUP(D176,'Coding and Prices'!A983:L985,3,0)","v":"P01"},25,null,{"$f":"((HLOOKUP(C176,'Coding and Prices'!A987:C988,2,0))*1.85)*1.06","v":74.518000000000001},{"$f":"Q175*P175","v":0}]
[null,null,"Complete with chain","Blue"]
[]
[null,"ID Tag","Colour","50 x 22mm",null,null,205,"-","A65","-",{"$f":"HLOOKUP(C179,'Coding and Prices'!A638:J639,2,0)","v":"P01"},"-",null,"S130",50,null,16.668500000000002,{"$f":"Q178*P178","v":0}]
[null,null,"Blue"]
[]
[null,"Lanyards","Complete with safety break hook","Colours",null,null,null,null,154,"-",{"$f":"HLOOKUP(D182,'Coding and Prices'!A675:J676,2,0)","v":"P05"},"-",null,"S082",10,null,20.590500000000002,{"$f":"Q181*P181","v":0}]
[null,null,null,"Yellow"]
[]
[null,"High Visual Lanyards","Complete with safety break hook","Colours",null,null,null,null,154,"-",{"$f":"HLOOKUP(D185,'Coding and Prices'!K675:L676,2,0)","v":"P63"},"-",null,"S082",10,null,20.590500000000002,{"$f":"Q184*P184","v":0}]
[null,null,null,"Hi Vis Yellow"]
[]
[null,"Large Paper Clip","80mm x 40mm (3.14\" x 1.6\")","Colours",null,null,null,null,210,"-","S243","-",null,{"$f":"HLOOKUP(D188,'Coding and Prices'!A678:J679,2,0)","v":"P07"},30,null,26.473500000000001,{"$f":"Q187*P187","v":0}]
[null,null,null,"Purple"]
[]
[null,"Metal Detectable Paper","Size","Pack Size",null,null,251,"-",{"$f":"HLOOKUP(C191,'Coding and Prices'!A1058:C1059,2,0)","v":"S04"},"-","P06","-",null,{"$f":"HLOOKUP(D191,'Coding and Prices'!A1058:F1060,3,0)","v":"X11"},null,null,{"$f":"((INDEX('Coding and Prices'!A1062:D1064,MATCH('Price List'!C191,'Coding and Prices'!A1062:A1064,0),MATCH('Price List'!D191,'Coding and Prices'!A1062:D1062,0)))*1.85)*1.06","v":80.008800000000008},{"$f":"Q190*P190","v":0}]
[null,null,"A4","100 Sheets"]
[]
[null,"Fully Detectable Paper Holder ","Size",null,null,null,null,null,254,"-",{"$f":"HLOOKUP(C194,'Coding and Prices'!A1067:C1068,2,0)","v":"S407"},"-",null,"P01",1,null,{"$f":"((HLOOKUP(C194,'Coding and Prices'!A1070:C1071,2,0))*1.85)*1.06","v":2.9807200000000003},{"$f":"Q193*P193","v":0}]
[null,null,"To suit Memo paper - 95 x 95 mm (3.7\" x 3.7\")"]
[]
[null,"Document Fastener","Reusable , 2 Part","Blue Only",null,null,209,"-","A65","-","A72","-",null,"P01",10,null,3.5298000000000003,{"$f":"Q196*P196","v":0}]
[]
[]
[null,"Whiteboard Film","Full Roll Size","Size",null,null,null,null,306,"-",{"$f":"HLOOKUP(D200,'Coding and Prices'!A1005:C1006,2,0)","v":"S121"},null,null,null,1,null,{"$f":"((HLOOKUP(D200,'Coding and Prices'!A1008:C1009,2,0))*1.85)*1.06","v":128.45535206400001},{"$f":"Q199*P199","v":0}]
[null,null,null,"3000 x 1000mm roll"]
[]
[null,"Detectable Tape Measure","Type","Measures Up to 5 metres",null,"Blue Only",null,null,468,"-","S575","-",null,{"$f":"HLOOKUP(C203,'Coding and Prices'!A1451:C1452,2,0)","v":"P64"},1,null,{"$f":"((HLOOKUP(C203,'Coding and Prices'!A1454:C1455,2,0))*1.85)*1.06","v":39.121949999999998},{"$f":"Q202*P202","v":0}]
[null,null,"Heavy Duty Stainless Steel Tape"]
[null,"Stainless Steel & Aluminium Range"]
[null,"CLIPBOARD RANGE\nStainless Steel Clipboards\nAluminium Clipboards\nStainless Steel Hanging Clipboard\nAluminium Hanging Clipboard\nClipboard with Ring Binder Mechanism\n\n","Document / File Holders\nRing Binders\nColour Coded Ring Binders\nLever Arch Files\nRing Binder Mechanism\nMobile Desks\nWall Mounted Document Holders\nFile Holders\nRecipe Card Holder",null,"Catering Equipment\nST/ST Handing Equipment\nST/ST Measuring Equipment\nST/ST Mixing Equipment\n",null,"Other\nA Frame Floor Sign\nUtility Stand\nFlip Charts\nTote Bin Cover Dispenser\nStainless Steel Dispensers\nRecipe Card Holder\nScrapers\n"]
[]
[null,"Stainless Steel Clipboard","Size/Orientation","Attachment",null,null,300,"-",{"$f":"INDEX('Coding and Prices'!A74:T77, MATCH(C207,'Coding and Prices'!A74:A77,0), MATCH(C208,'Coding and Prices'!A74:T74,0))","v":"O06"},"-","P45","-",{"$f":"INDEX('Coding and Prices'!A74:T77, MATCH(D207,'Coding and Prices'!A74:A77,0), MATCH(D208,'Coding and Prices'!A74:T74,0))","v":"A12"},null,1,null,{"$f":"((INDEX('Coding and Prices'!A79:N85,MATCH('Price List'!C208,'Coding and Prices'!A79:A85,0),MATCH('Price List'!D208,'Coding and Prices'!A79:N79,0)))*1.85)*1.06","v":22.555422},{"$f":"Q207*P207","v":0}]
[null,null,"A4 Portrait","Economy Chrome Plated"]
[]
[null,"Stainless Steel Ring Binder Clipboards","Size/Orientation","Attachment"]
[null,null,"A3 Landscape","4 Ring",null,null,300,"-","O04","-","P45","-",null,{"$f":"HLOOKUP(D211,'Coding and Prices'!K1011:L1013,3,0)","v":"A139"},1,null,{"$f":"((HLOOKUP(D211,'Coding and Prices'!A1018:C1019,2,0))*1.85)*1.06","v":49.268666016000005},{"$f":"Q211*P211","v":0}]
[null,null,"A4 Portrait","2 Ring",null,null,300,"-","O06","-","P45","-",null,"A138",1,null,26.431142400000002,{"$f":"Q212*P212","v":0}]
[null,null,"A4 Landscape","4 Ring",null,null,300,"-","O05","-","P45","-",null,"A139",1,null,26.875897200000001,{"$f":"Q213*P213","v":0}]
[null,null,"A4 Landscape","2 Ring",null,null,300,"-","O05","-","P45","-",null,"A138",1,null,26.431142400000002,{"$f":"Q214*P214","v":0}]
[]
[]
[null,"Folded Clipboards\n(Complete with clipboard clip)","Type","Attachment",null,null,null,null,null,null,null,null,null,null,1]
[null,null,"A4 Aluminium","Economy Chrome Plated",null,null,300,"-","O16","-",{"$f":"HLOOKUP(C218,'Coding and Prices'!B98:C99,2,0)","v":"P30"},"-",{"$f":"HLOOKUP(D218,'Coding and Prices'!D98:G100,3,0)","v":"A12"},null,null,null,{"$f":"((INDEX('Coding and Prices'!A102:E104,MATCH('Price List'!C218,'Coding and Prices'!A102:A104,0),MATCH('Price List'!D218,'Coding and Prices'!A102:E102,0)))*1.85)*1.06","v":30.921048000000006},{"$f":"Q218*P218","v":0}]
[]
[]
[null,"Stainless Steel - Rolled Clipboards\n(Complete with clipboard clip)","Type","Attachment",null,null,null,null,null,null,null,null,null,null,1,null,{"$f":"((HLOOKUP(D222,'Coding and Prices'!A136:E137,2,0))*1.85)*1.06","v":50.887950000000004},{"$f":"Q221*P221","v":0}]
[null,null,"A4","HD St/St Clip",null,null,300,"-","O17","-","P45","-",{"$f":"HLOOKUP(D222,'Coding and Prices'!A132:G134,3,0)","v":"A10"}]
[]
[]
[null,"Aluminium - Rolled Clipboards\n(Complete with clipboard clip)","Type","Attachment",null,null,null,null,null,null,null,null,null,null,1,null,{"$f":"((INDEX('Coding and Prices'!A139:E141,MATCH(C226,'Coding and Prices'!A139:A141,0),MATCH('Price List'!D226,'Coding and Prices'!A139:E139,0)))*1.85)*1.06","v":30.921048000000006},{"$f":"Q225*P225","v":0}]
[null,null,"A4","Economy St/St Clip",null,null,300,"-",{"$f":"HLOOKUP(C226,'Coding and Prices'!A132:C133,2,0)","v":"O17"},"-","P30","-",{"$f":"HLOOKUP(D226,'Coding and Prices'!A132:G134,3,0)","v":"A11"}]
[]
[]
[null,"Aluminium Clipboard","Size/Orientation","Attachment",null,null,300,"-",{"$f":"INDEX('Coding and Prices'!A74:T77, MATCH(C229,'Coding and Prices'!A74:A77,0), MATCH(C230,'Coding and Prices'!A74:T74,0))","v":"O05"},"-","P30","-",{"$f":"INDEX('Coding and Prices'!A60:AC64, MATCH(D229,'Coding and Prices'!A60:A64,0), MATCH(D230,'Coding and Prices'!A60:AC60,0))","v":"A15"},null,1,null,{"$f":"(INDEX('Coding and Prices'!A87:N93, MATCH(C230,'Coding and Prices'!A87:A93,0), MATCH(D230,'Coding and Prices'!A87:N87,0)))*1.85","v":46.25},{"$f":"P229*Q229","v":0}]
[null,null,"A4 Landscape","Blue HD St/St Clip"]
[]
[null,"Aluminium Ring Binder Clipboards","Size/Orientation","Attachment"]
[null,null,"A3 Landscape","4 Ring",null,null,300,"-","O04","-","P46","-",null,{"$f":"HLOOKUP(D233,'Coding and Prices'!K1011:L1013,3,0)","v":"A139"},1,null,{"$f":"((HLOOKUP(D233,'Coding and Prices'!A1021:C1022,2,0))*1.85)*1.06","v":23.453560000000003},{"$f":"Q233*P233","v":0}]
[null,null,"A4 Portrait","2 Ring",null,null,300,"-","O06","-","P46","-",null,"A138",1,null,18.213768000000002,{"$f":"Q234*P234","v":0}]
[null,null,"A4 Landscape","4 Ring",null,null,300,"-","O05","-","P46","-",null,"A139",1,null,18.658522800000004,{"$f":"Q235*P235","v":0}]
[null,null,"A4 Landscape","2 Ring",null,null,300,"-","O05","-","P46","-",null,"A138",1,null,18.213768000000002,{"$f":"Q236*P236","v":0}]
[]
[]
[null,"Clipboards Clips","Type",null,null,null,null,null,307,"-",{"$f":"HLOOKUP(C240,'Coding and Prices'!A146:H147,2,0)","v":"T186"},null,null,null,5,null,{"$f":"((HLOOKUP(C240,'Coding and Prices'!A149:H150,2,0))*1.85)*1.06","v":17.845100000000002},{"$f":"Q239*P239","v":0}]
[null,null,"120 x 30mm economy chrome plated (with hook)"]
[]
[null,"Magentic Pen Holder","Zinc Plated",null,null,null,null,null,308,"-","T189",null,null,null,10,null,17.256800000000002,{"$f":"Q242*P242","v":0}]
[]
[]
[null,"Bulldog Clips","Size",null,null,null,null,null,307,"-",{"$f":"HLOOKUP(C246,'Coding and Prices'!A120:C121,2,0)","v":"S392"},"-",null,"P32",5,null,{"$f":"((HLOOKUP(C246,'Coding and Prices'!A123:C124,2,0))*1.85)*1.06","v":48.044500000000006},{"$f":"Q245*P245","v":0}]
[null,null,"145mm (5.7\")"]
[]
[null,"Colour Coded Clipboards Clips\n(ST/ST)","Heavy Duty Clip","Colour",null,null,null,null,307,"-",{"$f":"HLOOKUP(D249,'Coding and Prices'!A106:E107,2,0)","v":"T091"},null,null,null,5,null,{"$f":"((HLOOKUP(D249,'Coding and Prices'!A109:E110,2,0))*1.85)*1.06","v":47.260100000000008},{"$f":"Q248*P248","v":0}]
[null,null,null,"Green"]
[]
[null,"Colour Coded Clipboards Clips\n(Econ Chrome)","Economy Chrome Clip","Colour",null,null,null,null,307,"-",{"$f":"HLOOKUP(D252,'Coding and Prices'!A112:E113,2,0)","v":"T140"},null,null,null,5,null,{"$f":"((HLOOKUP(D252,'Coding and Prices'!A115:E116,2,0))*1.85)*1.06","v":18.6295},{"$f":"Q251*P251","v":0}]
[null,null,null,"Blue"]
[null,"Document & File Holders"]
[]
[null,"Stainless Steel Ring Binders","Size/ Orientation","Type",null,null,311,"-","P45","-",{"$f":"HLOOKUP(C256,'Coding and Prices'!A321:C322,2,0)","v":"O06"},"-",null,{"$f":"HLOOKUP(D256,'Coding and Prices'!A321:F323,3,0)","v":"A30"},1,null,{"$f":"((INDEX('Coding and Prices'!A325:D327,MATCH('Price List'!C256,'Coding and Prices'!A325:A327,0),MATCH('Price List'!D256,'Coding and Prices'!A325:D325,0)))*1.85)*1.06","v":47.673478800000012},{"$f":"Q255*P255","v":0}]
[null,null,"A4 Portrait","2 Ring"]
[]
[null,"Aluminium Ring Binders","Size/ Orientation","Type",null,null,311,"-","P46","-",{"$f":"HLOOKUP(C259,'Coding and Prices'!A332:D333,2,0)","v":"O04"},"-",null,{"$f":"HLOOKUP(D259,'Coding and Prices'!A332:G334,3,0)","v":"A34"},1,null,{"$f":"((INDEX('Coding and Prices'!A336:D339,MATCH('Price List'!C259,'Coding and Prices'!A336:A339,0),MATCH('Price List'!D259,'Coding and Prices'!A336:D336,0)))*1.85)*1.06","v":51.76098720000001},{"$f":"Q258*P258","v":0}]
[null,null,"A3 Landscape","4 Ring"]
[]
[null,"Colour Coded Ring Binders\n(Aluminium)","A4","2 Ring Mechanism","Colour",null,311,"-",{"$f":"HLOOKUP(E262,'Coding and Prices'!A341:E342,2,0)","v":"P01"},"-","O01","-",null,"A143",1,null,{"$f":"((HLOOKUP(E262,'Coding and Prices'!A344:E345,2,0))*1.85)*1.06","v":38.015946},{"$f":"Q261*P261","v":0}]
[null,null,null,null,"Blue"]
[]
[null,"Ring Binder\n(Mechanism Only)","Chrome Plated","Type",null,null,null,null,316,"-","P42","-",null,{"$f":"HLOOKUP(D265,'Coding and Prices'!A353:F354,2,0)","v":"A32"},10,null,{"$f":"((HLOOKUP(D265,'Coding and Prices'!A356:F357,2,0))*1.85)*1.06","v":28.826700000000002},{"$f":"Q264*P264","v":0}]
[null,null,null,"3 ring (30mm diameter ring)"]
[]
[null,"Lever Arch File Files","Type",null,null,null,null,null,317,"-",{"$f":"HLOOKUP(C268,'Coding and Prices'!A347:C348,2,0)","v":"P31"},"-",null,"O18",1,null,{"$f":"((HLOOKUP(C268,'Coding and Prices'!A350:C351,2,0))*1.85)*1.06","v":45.19725350400001},{"$f":"Q267*P267","v":0}]
[null,null,"Aluminium"]
[]
[null,"Anodised Aluminium Mobile Desks","Type",null,null,null,null,null,317,"-",{"$f":"HLOOKUP(C271,'Coding and Prices'!A361:E362,2,0)","v":"S791"},null,null,null,1,null,{"$f":"((HLOOKUP(C271,'Coding and Prices'!A364:E365,2,0))*1.85)*1.06","v":28.358413200000008},{"$f":"Q270*P270","v":0}]
[null,null,"Top Hinged"]
[]
[null,"Anodised Aluminium Form Holder\n(Side Hinged)","Size",null,null,null,null,null,328,"-","H03","-",null,{"$f":"HLOOKUP(C274,'Coding and Prices'!A369:D370,2,0)","v":"S798"},1,null,{"$f":"((HLOOKUP(C274,'Coding and Prices'!A372:D373,2,0))*1.85)*1.06","v":33.692082192000008},{"$f":"Q273*P273","v":0}]
[null,null,"W - 230mm x L - 360mm x H 20mm"]
[]
[null,"Anodised Aluminium Form Holder\n(Top Hinged)",null,null,null,null,null,null,328,"-","H01","-",null,"S791",1,null,27.571660000000005,{"$f":"Q276*P276","v":0}]
[null,null,"W - 230mm x L - 360mm x \nH 25mm"]
[]
[null,"Anodised Aluminium Form Holder\n(Bottom Hinged)","Size",null,null,null,null,null,328,"-","H04","-",null,{"$f":"HLOOKUP(C280,'Coding and Prices'!A377:C378,2,0)","v":"S794"},1,null,{"$f":"((HLOOKUP(C280,'Coding and Prices'!A380:C381,2,0))*1.85)*1.06","v":32.662792512000003},{"$f":"Q279*P279","v":0}]
[null,null,"W - 235mm x L - 320mm x H 30mm"]
[]
[null,"Anodised Aluminium Form Holder\n(Right Side Hinged)",null,null,null,null,null,null,328,"-","H02","-",null,"S792",1,null,28.358413200000008,{"$f":"Q282*P282","v":0}]
[null,null,"W - 230mm x L - 360mm x \nH 20mm"]
[]
[null,"Anodised Aluminium Form Holder\n(Bottom Hinged - Slim Type)",null,null,null,null,null,null,328,"-","H05","-",null,"S796",1,null,23.635540800000005,{"$f":"Q285*P285","v":0}]
[null,null,"W - 230mm x L - 360mm x \nH 20mm"]
[]
[null,"Anodised Aluminium Card Holder","Orientation",null,null,null,null,null,326,"-","O12","-",null,{"$f":"HLOOKUP(C289,'Coding and Prices'!A383:C384,2,0)","v":"H09"},1,null,31.317170000000004,{"$f":"Q288*P288","v":0}]
[null,null,"Horizontal"]
[]
[null,"Recipe Card Holder","A4","Type",null,null,null,null,320,"-","O18","-",null,{"$f":"HLOOKUP(D292,'Coding and Prices'!A388:C389,2,0)","v":"P30"},1,null,{"$f":"((HLOOKUP(D292,'Coding and Prices'!A391:C392,2,0))*1.85)*1.06","v":15.462218304000002},{"$f":"Q291*P291","v":0}]
[null,null,null,"Aluminium"]
[]
[null,"Document Trays","Stainless Steel","Size",null,null,null,null,320,"-","O18","-",null,{"$f":"HLOOKUP(D295,'Coding and Prices'!A394:C395,2,0)","v":"S240"},1,null,{"$f":"((HLOOKUP(D295,'Coding and Prices'!A397:C398,2,0))*1.85)*1.06","v":90.325887696000024},{"$f":"Q294*P294","v":0}]
[null,null,null,"Standard"]
[]
[null,"Stainless Steel File Holders","Type",null,null,null,null,null,312,"-","P32","-",null,{"$f":"HLOOKUP(C298,'Coding and Prices'!A400:D401,2,0)","v":"S253"},1,null,{"$f":"((HLOOKUP(C298,'Coding and Prices'!A403:D404,2,0))*1.85)*1.06","v":176.031408384},{"$f":"Q297*P297","v":0}]
[null,null,"3 Space File Holder"]
[]
[null,"Stainless Steel Wall Mounted Document/Clipboard Holder","Size",null,null,null,null,null,458,"-",{"$f":"HLOOKUP(C301,'Coding and Prices'!A660:C661,2,0)","v":"S04"},null,null,null,1,null,{"$f":"((HLOOKUP(C301,'Coding and Prices'!A663:C664,2,0))*1.85)*1.06","v":59.355704880000012},{"$f":"Q300*P300","v":0}]
[null,null,"A4"]
[]
[null,"Colour Coded Stainless Steel Wall Mounted Document/Clipboard Holder","A4","Colour",null,null,null,null,458,"-","S04","-",null,{"$f":"HLOOKUP(D304,'Coding and Prices'!A1082:E1083,2,0)","v":"P01"},1,null,66.226107600000006,{"$f":"Q303*P303","v":0}]
[null,null,null,"Blue"]
[]
[null,"Stainless Steel Wall Mounted File Holders","A4","Orientation",null,null,null,null,322,"-","P32","-",null,{"$f":"HLOOKUP(D307,'Coding and Prices'!A1317:C1318,2,0)","v":"O06"},1,null,50.887950000000004,{"$f":"Q306*P306","v":0}]
[null,null,null,"Portrait"]
[null,"Catering Equipment"]
[]
[null,"Buckets\n(304 -ST/ST)","Type","Capacity Size",null,null,null,null,{"$f":"HLOOKUP(C311,'Coding and Prices'!A825:C826,2,0)","v":562},"-","P32","-",{"$f":"HLOOKUP(D311,'Coding and Prices'!A825:G827,3,0)","v":"S029"},null,1,null,{"$f":"((INDEX('Coding and Prices'!A829:E831,MATCH('Price List'!C311,'Coding and Prices'!A829:A831,0),MATCH('Price List'!D311,'Coding and Prices'!A829:E829,0)))*1.85)*1.06","v":51.930417600000006},{"$f":"P310*Q310","v":0}]
[null,null,"Bucket Lids","10 Litre"]
[]
[null,"Buckets - Reinforced Foot\n(304 -ST/ST)","Capacity Size",null,null,null,null,null,572,"-","P44","-",{"$f":"HLOOKUP(C314,'Coding and Prices'!A833:D834,2,0)","v":"S034"},null,1,null,{"$f":"((HLOOKUP(C314,'Coding and Prices'!A836:D837,2,0))*1.85)*1.06","v":244.53042479999999},{"$f":"P313*Q313","v":0}]
[null,null,"15 Litre"]
[]
[null,"Buckets - Heavy Duty Acid Resistant\n(304 -ST/ST)"]
[null,null,"12 Litre",null,null,null,null,null,583,"-","P44","-",null,"S031",1,null,468.98334720000008,{"$f":"P317*Q317","v":0}]
[null,null,"Bucket Lid","Suits Acid Resistant Bucket",null,null,null,null,584,"-","T068",null,null,null,1,null,170.84937960000005,{"$f":"P318*Q318","v":0}]
[]
[]
[null,"Buckets - without lid\nwith draining foot, pouring lip","304 ST/ST - Extra Heavy Gauge","Capacity Size",null,null,null,null,587,"-","P45","-",{"$f":"HLOOKUP(D322,'Coding and Prices'!A839:E840,2,0)","v":"S039"},null,1,null,{"$f":"((HLOOKUP(D322,'Coding and Prices'!A842:E843,2,0))*1.85)*1.06","v":666.64508760000012},{"$f":"P321*Q321","v":0}]
[null,null,null,"20 Litre"]
[]
[null,"Multi Purpose Containers \n304 Stainless Steel","Standard","Capacity Size",null,null,null,null,569,"-","P32","-",{"$f":"HLOOKUP(D325,'Coding and Prices'!A845:D846,2,0)","v":"S040"},null,1,null,{"$f":"((HLOOKUP(D325,'Coding and Prices'!A848:D849,2,0))*1.85)*1.06","v":803.9684268000002},{"$f":"P324*Q324","v":0}]
[null,null,null,"25 Litre"]
[null,null,"With reinforced handles","Capacity Size",null,null,585,"-","A136","-","P44","-",{"$f":"HLOOKUP(D327,'Coding and Prices'!A851:E852,2,0)","v":"S045"},null,1,null,{"$f":"((HLOOKUP(D327,'Coding and Prices'!A854:E855,2,0))*1.85)*1.06","v":2341.5493068000001},{"$f":"P326*Q326","v":0}]
[null,null,null,"150 Litre"]
[]
[null,"Multi Purpose Containers \nLids","Capacity Size",null,null,null,null,null,563,"-","P44","-",{"$f":"HLOOKUP(C330,'Coding and Prices'!A857:H858,2,0)","v":"S043"},null,1,null,{"$f":"((HLOOKUP(C330,'Coding and Prices'!A860:H861,2,0))*1.85)*1.06","v":200.98681200000007},{"$f":"P329*Q329","v":0}]
[null,null,"75 Litre"]
[]
[null,"Castors - For multi purpose containers","Capacity Size",null,null,null,null,null,564,"-","P44","-",{"$f":"HLOOKUP(C333,'Coding and Prices'!A863:F864,2,0)","v":"S040"},null,1,null,{"$f":"((HLOOKUP(C333,'Coding and Prices'!A866:F867,2,0))*1.85)*1.06","v":349.55609400000009},{"$f":"P332*Q332","v":0}]
[null,null,"25 & 30 Litre"]
[]
[null,"Measuring Jugs \n(304 Stainless Steel)\n","Stackable","Capacity Size",null,null,567,"-","T162","-","P45","-",{"$f":"HLOOKUP(D336,'Coding and Prices'!A869:F870,2,0)","v":"S006"},null,1,null,{"$f":"((HLOOKUP(D336,'Coding and Prices'!A872:F873,2,0))*1.85)*1.06","v":21.115263600000006},{"$f":"P335*Q335","v":0}]
[null,null,null,"0.5 Litre"]
[null,null,"Non Stackable","Capacity Size",null,null,567,null,"T163","-","P45","-",{"$f":"HLOOKUP(D338,'Coding and Prices'!A875:E876,2,0)","v":"S018"},null,1,null,{"$f":"((HLOOKUP(D338,'Coding and Prices'!A878:E879,2,0))*1.85)*1.06","v":62.646890400000011},{"$f":"P337*Q337","v":0}]
[null,null,null,"2.0 Litre"]
[null,null,"Straight sided","Capacity Size",null,null,567,"-","T164","-","P45","-",{"$f":"HLOOKUP(D340,'Coding and Prices'!A881:E882,2,0)","v":"S015"},null,1,null,{"$f":"((HLOOKUP(D340,'Coding and Prices'!A884:E885,2,0))*1.85)*1.06","v":96.130573200000015},{"$f":"P339*Q339","v":0}]
[null,null,null,"1.5 Litre"]
[]
[null,"Measuring Jugs - Straight sided \nmirror polished ","(304 ST/ST)","Capacity Size",null,null,567,"-","T165","-","P45","-",{"$f":"HLOOKUP(D343,'Coding and Prices'!A887:G888,2,0)","v":"S013"},null,1,null,{"$f":"((HLOOKUP(D343,'Coding and Prices'!A890:G891,2,0))*1.85)*1.06","v":85.774140000000017},{"$f":"P342*Q342","v":0}]
[null,null,null,"1.3 Litre"]
[]
[null,"Measuring Jugs - Narrow Mouthed\nnon graduated (304 ST/ST)","Capacity Size",null,null,null,567,"-","T166","-","P45","-",{"$f":"HLOOKUP(C346,'Coding and Prices'!A893:H894,2,0)","v":"S008"},null,1,null,{"$f":"((HLOOKUP(C346,'Coding and Prices'!A896:H897,2,0))*1.85)*1.06","v":37.571191200000001},{"$f":"P345*Q345","v":0}]
[null,null,"0.3 Litre"]
[]
[null,"Churns - Complete with Lid\n(304 Stainless Steel)","Stackable","Capacity Size",null,null,568,"-","T162","-","P44","-",{"$f":"HLOOKUP(D349,'Coding and Prices'!A899:E900,2,0)","v":"S018"},null,1,null,{"$f":"((HLOOKUP(D349,'Coding and Prices'!A902:E903,2,0))*1.85)*1.06","v":131.07559320000001},{"$f":"P348*Q348","v":0}]
[null,null,null,"2 Litre"]
[null,null,"Non Stackable","Capacity Size",null,null,568,"-","T163","-","P44","-",{"$f":"HLOOKUP(D351,'Coding and Prices'!A905:D906,2,0)","v":"S029"},null,1,null,{"$f":"((HLOOKUP(D351,'Coding and Prices'!A908:D909,2,0))*1.85)*1.06","v":859.30863120000015},{"$f":"P350*Q350","v":0}]
[null,null,null,"10 Litre"]
[null,null,"With Pouring Lip","Capacity Size",null,null,568,"-","T169","-","P44","-",{"$f":"HLOOKUP(D353,'Coding and Prices'!A911:D912,2,0)","v":"S039"},null,1,null,{"$f":"((HLOOKUP(D353,'Coding and Prices'!A914:D915,2,0))*1.85)*1.06","v":1427.3452260000004},{"$f":"P352*Q352","v":0}]
[null,null,null,"20 Litre"]
[]
[null,"Funnels- Heavy Gauge\n(304 ST/ST)","Size",null,null,null,565,"-","T161","-","P32","-",{"$f":"HLOOKUP(C356,'Coding and Prices'!A917:H918,2,0)","v":"S412"},null,1,null,{"$f":"((HLOOKUP(C356,'Coding and Prices'!A920:H921,2,0))*1.85)*1.06","v":39.329031600000008},{"$f":"P355*Q355","v":0}]
[null,null,"110mm dia"]
[]
[null,"Funnels- With hanging hoop\n(304 ST/ST)","Size",null,null,null,566,"-","A137","-","P44","-",{"$f":"HLOOKUP(C359,'Coding and Prices'!A923:C924,2,0)","v":"S418"},null,1,null,{"$f":"((HLOOKUP(C359,'Coding and Prices'!A926:C927,2,0))*1.85)*1.06","v":288.37054080000007},{"$f":"P358*Q358","v":0}]
[null,null,"400mm dia"]
[]
[null,"Bowls\n304 Stainless Steel","Size",null,null,null,null,null,559,"-","P32","-",{"$f":"HLOOKUP(C362,'Coding and Prices'!A929:N930,2,0)","v":"S033"},null,1,null,{"$f":"((HLOOKUP(C362,'Coding and Prices'!A932:N933,2,0))*1.85)*1.06","v":110.36272680000002},{"$f":"P361*Q361","v":0}]
[null,null,"14.0 Litre"]
[]
[null,"Bailing Bowls\n304 Stainless Steel","Size",null,null,null,null,null,560,"-","P44","-",{"$f":"HLOOKUP(C365,'Coding and Prices'!A935:D936,2,0)","v":"S195"},null,1,null,{"$f":"((HLOOKUP(C365,'Coding and Prices'!A938:D939,2,0))*1.85)*1.06","v":70.014571344000018},{"$f":"P364*Q364","v":0}]
[null,null,"2.0 ltr x 200mm dia"]
[]
[null,"Flour Scoops\n304 Stainless Steel",null,"Size"]
[null,null,"Flat Handle","0.1 Litre",null,null,574,"-","T171","-","P44","-",null,{"$f":"HLOOKUP(D368,'Coding and Prices'!A941:F942,2,0)","v":"S001"},1,null,{"$f":"((HLOOKUP(D368,'Coding and Prices'!A944:F945,2,0))*1.85)*1.06","v":36.185250528000005},{"$f":"P368*Q368","v":0}]
[null,null,"Angled hollow handle","1.3 Litre",null,null,574,"-","T172","-","P44","-",null,{"$f":"HLOOKUP(D369,'Coding and Prices'!A947:E948,2,0)","v":"S013"},1,null,{"$f":"((HLOOKUP(D369,'Coding and Prices'!A950:E951,2,0))*1.85)*1.06","v":70.769383776000012},{"$f":"P369*Q369","v":0}]
[]
[]
[null,"Shovel\n304 Stainless Steel","Type","Size",null,null,null,null,{"$f":"HLOOKUP(C373,'Coding and Prices'!A1028:C1029,2,0)","v":"670R"},"-",{"$f":"HLOOKUP(D373,'Coding and Prices'!A1028:H1030,3,0)","v":"T333"},null,null,null,1,null,{"$f":"((INDEX('Coding and Prices'!A1032:F1034,MATCH('Price List'!C373,'Coding and Prices'!A1032:A1034,0),MATCH('Price List'!D373,'Coding and Prices'!A1032:F1032,0)))*1.85)*1.06","v":253.89145440000004},{"$f":"P372*Q372","v":0}]
[null,null,"Reinforced","7\" x 11\" Blade"]
[]
[null,"Pharma Scoops\n316 Stainless Steel","Weight","Size",null,null,null,null,674,"-",{"$f":"HLOOKUP(C376,'Coding and Prices'!A1310:F1311,2,0)","v":"S563"},"-",{"$f":"HLOOKUP(D376,'Coding and Prices'!G1310:Q1312,3,0)","v":"A175"},null,1,null,{"$f":"((HLOOKUP(D376,'Coding and Prices'!A1314:L1315,2,0))*1.85)*1.06","v":86.284000000000006},{"$f":"P375*Q375","v":0}]
[null,null,"64oz","5.5\" x 9\" Bowl, 4\" Handle"]
[]
[null,"Bowl Scoops\n304 Stainless Steel","Weight","Size",null,null,null,null,673,"-",{"$f":"HLOOKUP(C379,'Coding and Prices'!A1320:I1321,2,0)","v":"S563"},"-",{"$f":"HLOOKUP(D379,'Coding and Prices'!A1320:S1322,3,0)","v":"A113"},null,1,null,{"$f":"((HLOOKUP(D379,'Coding and Prices'!A1324:K1325,2,0))*1.85)*1.06","v":86.284000000000006},{"$f":"P378*Q378","v":0}]
[null,null,"64oz","4.25\" x 6.6\" Bowl, 24\" Handle"]
[]
[null,"Shovel\n316 Stainless Steel","Size",null,null,null,null,null,670,"-",{"$f":"HLOOKUP(C382,'Coding and Prices'!A1037:E1038,2,0)","v":"T338"},null,null,null,1,null,{"$f":"((HLOOKUP(C382,'Coding and Prices'!A1040:E1041,2,0))*1.85)*1.06","v":260.75338560000006},{"$f":"P381*Q381","v":0}]
[null,null,"7\" x 11\" Blade"]
[]
[null,"Paddle\n304 Stainless Steel","Size",null,null,null,null,null,671,"-",{"$f":"HLOOKUP(C385,'Coding and Prices'!A1043:E1044,2,0)","v":"S066"},null,null,null,1,null,{"$f":"((HLOOKUP(C385,'Coding and Prices'!A1046:E1047,2,0)))","v":145.44},{"$f":"P384*Q384","v":0}]
[null,null,"60\" Long"]
[]
[null,"Fork\n304 Stainless Steel","Type","Size",null,null,null,null,672,"-",{"$f":"HLOOKUP(C388,'Coding and Prices'!A1049:D1050,2,0)","v":"T133"},"-",null,{"$f":"HLOOKUP(D388,'Coding and Prices'!A1049:H1051,3,0)","v":"S500"},1,null,{"$f":"((INDEX('Coding and Prices'!A1053:E1056,MATCH('Price List'!C388,'Coding and Prices'!A1053:A1056,0),MATCH('Price List'!D388,'Coding and Prices'!A1053:E1053,0)))*1.85)*1.06","v":239.32044000000005},{"$f":"P387*Q387","v":0}]
[null,null,"Standard","5 Tines - 12\"Long"]
[null,"Other"]
[]
[null,"Stainless Steel A Frame Floor Sign","Type",null,null,null,null,null,364,"-",{"$f":"HLOOKUP(C392,'Coding and Prices'!A423:E424,2,0)","v":"T130"},null,null,null,1,null,{"$f":"((HLOOKUP(C392,'Coding and Prices'!A426:E427,2,0))*1.85)*1.06","v":372.64883000000003},{"$f":"Q391*P391","v":0}]
[null,null,"Laser Engraved Both Sides"]
[]
[null,"Stainless Steel Utility Stand","Own Branding Available",null,null,null,null,null,598,"-","P49",null,null,null,1,null,20.119860000000006,{"$f":"Q394*P394","v":0}]
[]
[]
[null,"Aluminium Flip Charts","Size / Orientation","Attachment",null,null,null,null,315,"-",{"$f":"HLOOKUP(C398,'Coding and Prices'!A429:D430,2,0)","v":"O06"},"-",null,{"$f":"HLOOKUP(D398,'Coding and Prices'!A429:F431,3,0)","v":"A35"},1,null,{"$f":"((INDEX('Coding and Prices'!A433:C436,MATCH('Price List'!C398,'Coding and Prices'!A433:A436,0),MATCH('Price List'!D398,'Coding and Prices'!A433:C433,0)))*1.85)*1.06","v":53.523063360000009},{"$f":"Q397*P397","v":0}]
[null,null,"A4 Portrait","2 Ring Mechansim"]
[]
[null,"Stainless Steel File Holder \nWith Hanging Hook","Draining holes for easy cleaning",null,null,null,null,null,595,"-","A98",null,null,null,1,null,52.841106000000011,{"$f":"Q400*P400","v":0}]
[]
[null,"Food Preparation, Storage & Handling Equipment"]
[null,"Mixing & Handling Equipment\nFlexible Scrapers\nRigid Scrapers\nSerrated Edge Scrapers\nStainless Steel Scrapers\nStirrers & Spatula's\nDetectable Paddles\nDetectable Scoops\nDetectable Jugs\nDetectable Buckets\n\n","Tools , Tags & Accessories\nSafety Knives\nDisposable Safety Knives\nProfessional Knives\nHammer/Mallet\nKeyhole Tags\nHigh Heat Tags\nID Tags\nCable Ties\nReusable Cable Ties",null,"Storage Equipment\nStorage Containers\nDetectable Catering Bins\nAirtight Bowls\nWall Mounted File Holders\nStorage Box\nShadow Boards\n\n\n\n",null,"Other Storage / Handling Equipment\nBag Sealer/Gripper                                                   Plastic clip       \nDetectable Prover Pockets                                    Sampling Equipment\nDetectable Polythene Tote Bin Covers             Detectbale Pallet Wrap\nDetectable Polythene Film                                    Detectable Rubber Bands\nDetectable Stretch Wrap Tape                             Shovels & Spades\nDisnfectant & Probe Wipes                                   Detectable Squeegee\nDetectable Brushes & Brooms                             Detectable Dustpan\n"]
[]
[null,"Scraper Type","Size","Colour"]
[null,"Flexi Scraper","Large","Black",null,null,523,"-",{"$f":"HLOOKUP(C406,'Coding and Prices'!A242:C243,2,0)","v":"S091"},"-","T103","-",null,{"$f":"HLOOKUP(D406,'Coding and Prices'!A242:L244,3,0)","v":"P02"},5,null,{"$f":"((HLOOKUP(C406,'Coding and Prices'!A237:C238,2,0))*1.85)*1.06","v":20.002200000000002},{"$f":"Q406*P406","v":0}]
[null,"Serrated Edge Scraper","Large","Blue",null,null,523,"-",{"$f":"HLOOKUP(C407,'Coding and Prices'!A242:C243,2,0)","v":"S091"},"-","T097","-",null,{"$f":"HLOOKUP(D407,'Coding and Prices'!D242:L244,3,0)","v":"P01"},5,null,{"$f":"((HLOOKUP(C407,'Coding and Prices'!A246:C247,2,0))*1.85)*1.06","v":17.060700000000001},{"$f":"Q407*P407","v":0}]
[null,"Detectable Hand Scraper","3\"","Blue",null,null,523,"-",{"$f":"HLOOKUP(C408,'Coding and Prices'!A252:C253,2,0)","v":"S104"},"-","T205","-",null,{"$f":"HLOOKUP(D408,'Coding and Prices'!D252:L254,3,0)","v":"P01"},5,null,{"$f":"((HLOOKUP(C408,'Coding and Prices'!A256:C257,2,0))*1.85)*1.06","v":15.2958},{"$f":"Q408*P408","v":0}]
[null,"Detectable Flexible Hand Scraper","2\"","Blue",null,null,523,"-","S103","-","T205","-",null,"P01",5,null,25.296900000000004,{"$f":"Q409*P409","v":0}]
[]
[null,"Scrapers - Plastic handle / Metal Blade","Type",null,null,null,522,"-",{"$f":"HLOOKUP(C412,'Coding and Prices'!A261:C262,2,0)","v":"S095"},"-","W11","-",null,"Q01",1,null,{"$f":"((HLOOKUP(C412,'Coding and Prices'!A264:C265,2,0))*1.85)*1.06","v":14.511400000000002},{"$f":"Q411*P412","v":0}]
[null,null,"Flexi -  Blade Size = 120mm (4.7\")"]
[null,null,"Handle Type","Blade Type"]
[null,"Scrapers - Plastic/ Metal","Detectable plastic","Stainless Steel",null,"Size",586,"-","W11","-","Q03","-",null,{"$f":"HLOOKUP(F415,'Coding and Prices'!A953:D954,2,0)","v":"S421"},1,null,{"$f":"((HLOOKUP(F415,'Coding and Prices'!A956:D957,2,0))*1.85)*1.06","v":26.875897200000004},0]
[null,null,null,null,null,"38mm Blade (1.5\")"]
[null,null,"Detectable plastic ","Brass",null,"Size",586,"-","W11","-","Q02","-",null,{"$f":"HLOOKUP(F417,'Coding and Prices'!B953:D954,2,0)","v":"S421"},1,null,{"$f":"((HLOOKUP(F417,'Coding and Prices'!A959:D960,2,0))*1.85)*1.06","v":35.178833952000012},0]
[null,null,null,null,null,"38mm Blade (1.5\")"]
[null,null,"Stainless Steel","Stainless Steel",null,"Size",586,"-","W02","-","Q03","-",null,{"$f":"HLOOKUP(F419,'Coding and Prices'!B953:D954,2,0)","v":"S421"},1,null,{"$f":"((HLOOKUP(F419,'Coding and Prices'!A962:D963,2,0))*1.85)*1.06","v":34.675625664000009},0]
[null,null,null,null,null,"38mm Blade (1.5\")"]
[null,null,"Stainless Steel ","Brass",null,"Size",586,"-","W02","-","Q02","-",null,{"$f":"HLOOKUP(F421,'Coding and Prices'!A953:D954,2,0)","v":"S421"},1,null,{"$f":"((HLOOKUP(F421,'Coding and Prices'!A965:D966,2,0))*1.85)*1.06","v":35.430438096000003},0]
[null,null,null,null,null,"38mm Blade (1.5\")"]
[null,null,"Aluminium","Stainless Steel",null,"Size",586,"-","W03","-","Q03","-",null,{"$f":"HLOOKUP(F423,'Coding and Prices'!A953:D954,2,0)","v":"S421"},1,null,{"$f":"((HLOOKUP(F423,'Coding and Prices'!A968:D969,2,90))*1.85)*1.06","v":30.924436608000004},0]
[null,null,null,null,null,"38mm Blade (1.5\")"]
[]
[null,"Stainless Steel Scraper","Size",null,null,null,586,"-","W11","-","Q03","-",null,{"$f":"HLOOKUP(C426,'Coding and Prices'!A971:D972,2,0)","v":"S233"},1,null,{"$f":"((HLOOKUP(C426,'Coding and Prices'!A974:D975,2,0))*1.85)*1.06","v":25.938099936},{"$f":"Q425*P425","v":0}]
[null,null,"12mm (0.47\") wide blade"]
[]
[null,"Stirrers / Scraper","Type","Colour",null,null,null,null,517,"-",{"$f":"HLOOKUP(C429,'Coding and Prices'!A277:C278,2,0)","v":"A50"},"-",{"$f":"HLOOKUP(D429,'Coding and Prices'!A277:H279,3,0)","v":"P06"},null,1,null,{"$f":"((HLOOKUP(C429,'Coding and Prices'!A281:C282,2,0))*1.85)*1.06","v":7.1584344000000009},{"$f":"Q428*P428","v":0}]
[null,null,"With Holes","White"]
[]
[null,"Spatula - Detectable","160 x 6.85 dia shaft, 20mm blade","Blue",null,null,null,null,518,"-","S261","-",null,"P01",10,null,6.0791000000000004,{"$f":"Q431*P431","v":0}]
[]
[]
[null,"Detectable Large Paddle","With Holes","Blue",null,null,null,null,531,"-","S249","-","A50",null,1,null,129.21185880000002,{"$f":"Q434*P434","v":0}]
[]
[]
[null,"Detectable Flexible Palette Knife","Blue",null,null,null,null,null,521,"-","T102","-","P01",null,1,null,3.4905800000000005,{"$f":"Q437*P437","v":0}]
[]
[]
[null,"Detectable Plastic Scoop","Size","Colour",null,null,514,"-",{"$f":"HLOOKUP(C441,'Coding and Prices'!A154:N156,2,0)","v":"S088"},"-",{"$f":"HLOOKUP(D441,'Coding and Prices'!A154:N156,3,0)","v":"P01"},"-","Z03",null,5,null,{"$f":"((HLOOKUP(C441,'Coding and Prices'!A158:E159,2,0))*1.85)*1.06","v":89.225499999999997},{"$f":"P440*Q440","v":0}]
[null,null,"Large 1000g","Blue"]
[]
[null,"Detectable Plastic - Flour Scoop","Size","Colour",null,null,515,"-",{"$f":"HLOOKUP(C444,'Coding and Prices'!A161:M163,2,0)","v":"S089 - S048"},null,null,"-",null,{"$f":"HLOOKUP(D444,'Coding and Prices'!A161:F163,3,0)","v":"P01"},5,null,{"$f":"((HLOOKUP(C444,'Coding and Prices'!A165:D166,2,0))*1.85)*1.06","v":39.60435600000001},{"$f":"P443*Q443","v":0}]
[null,null,"Small 250ml","Blue"]
[]
[null,"Detectable Round Bowl Scoop","2 Litre / 3 Pint Capacity","Colour",null,null,514,"-","S240","-",{"$f":"HLOOKUP(D447,'Coding and Prices'!A168:J169,2,0)","v":"P01"},"-","Z01",null,5,null,76.479000000000013,{"$f":"P446*Q446","v":0}]
[null,null,null,"Blue"]
[]
[null,"Scooping Jug ","2 Litre / 3 Pint Capacity","Colour",null,null,535,"-","S108","-","T101","-",{"$f":"HLOOKUP(D450,'Coding and Prices'!A171:J172,2,0)","v":"P01"},null,1,null,15.312272400000001,{"$f":"P449*Q449","v":0}]
[null,null,null,"Blue"]
[]
[null,"Stackable Pouring Jugs","1 Litre  / 2 Pint Capacity","Colour",null,null,535,"-","S112","-","T100","-",{"$f":"HLOOKUP(D453,'Coding and Prices'!A171:J172,2,0)","v":"P01"},null,1,null,6.1771500000000001,{"$f":"P452*Q452","v":0}]
[null,null,null,"Blue"]
[]
[null,"Stackable Pouring Jugs","2 Litre  / 3 Pint Capacity","Colour",null,null,535,"-","S108","-","T100","-",{"$f":"HLOOKUP(D456,'Coding and Prices'!A174:J175,2,0)","v":"P01"},null,1,null,9.0402100000000019,{"$f":"P455*Q455","v":0}]
[null,null,null,"Blue"]
[]
[null,"Pouring Jug with Lid","1 Litre / 2 Pint Capacity","Blue",null,null,535,"-","S012","-","T390","-","P01",null,1,null,3.9220000000000006,{"$f":"P458*Q458","v":0}]
[]
[]
[null,"Economy Detectable Bucket \n(Complete with Lid)","10 Litre / 17 Pint Capacity","Colour",null,null,null,null,533,"-","S029","-",{"$f":"HLOOKUP(D462,'Coding and Prices'!A977:F978,2,0)","v":"A42"},null,5,null,82.55810000000001,{"$f":"P461*Q461","v":0}]
[null,null,null,"Blue"]
[]
[null,"Detectable Bucket","9 Litre / 15 Pint Capacity","Blue",null,null,505,"-","P01","-","S028","-","A146",null,1,null,41.84930880000001,{"$f":"P464*Q464","v":0}]
[]
[]
[null,"Detectable Bucket \n(Complete with Lid)","12 Litre / 21 Pint Capacity","Blue",null,null,505,"-","P01","-","S031","-","A42",null,1,null,52.311636000000007,{"$f":"P467*Q467","v":0}]
[]
[null,"Tools & Accessories"]
[]
[null,"Safety Knives \n(Detectable Handle)"]
[null,null,"SK100","  Knife with blade lock",null,null,615,"-","K100","-","T191","-",null,"P01",1,null,20.734045200000001,{"$f":"Q472*P472","v":0}]
[null,null,"SK101 ","Knife",null,null,615,"-","K101","-","T184","-",null,"P01",1,null,19.281400000000001,{"$f":"Q473*P473","v":0}]
[null,null,"SK102 ","Right/Left Hand (Ambidextrous)",null,null,615,"-","K102","-","T038","-",null,"P30",1,null,25.838136000000002,{"$f":"Q474*P474","v":0}]
[null,null,"SK104","Knife",null,null,615,"-","K104","-","T184","-",null,"P01",5,null,44.899056000000009,{"$f":"Q475*P475","v":0}]
[null,null,null,null,null,"Colour"]
[null,null,"SK106","Disposable - Penguin",null,"Blue",615,"-","K106","-","T030","-",null,{"$f":"HLOOKUP(F477,'Coding and Prices'!A554:E555,2,0)","v":"P01"},5,null,31.277950000000001,{"$f":"Q477*P477","v":0}]
[null,null,"SK107","Heavy Duty - Penguin",null,"Blue",615,"-","K106","-","T030","-",null,{"$f":"HLOOKUP(F478,'Coding and Prices'!A554:E555,2,0)","v":"P01"},5,null,38.244799999999998,{"$f":"Q478*P478","v":0}]
[null,null,"SK108","Type",null,"Colour ",null,null,null,null,null,"-"]
[null,null,null,"M Fish c/w hook & cover",null,"Blue",615,"-","K108","-",{"$f":"HLOOKUP(D480,'Coding and Prices'!A557:D558,2,0)","v":"T194"},"-",null,{"$f":"HLOOKUP(F480,'Coding and Prices'!A557:H559,3,0)","v":"P01"},5,null,{"$f":"((HLOOKUP(D480,'Coding and Prices'!A561:D562,2,0))*1.85)*1.06","v":37.740621600000011},{"$f":"Q480*P480","v":0}]
[null,null,"SK109","Type"]
[null,null,null,"Fish c/w tape cutter",null,"Blue Only",615,"-","K109","-",{"$f":"HLOOKUP(D482,'Coding and Prices'!A564:D565,2,0)","v":"T193"},"-",null,"P01",5,null,{"$f":"((HLOOKUP(D482,'Coding and Prices'!A567:D568,2,0))*1.85)*1.06","v":50.206463280000008},{"$f":"Q482*P482","v":0}]
[null,null,"SK111","Boxer Knife",null,"Blue Only",615,"-","K111","-","T033","-",null,"P01",1,null,18.616165200000001,{"$f":"Q483*P483","v":0}]
[null,null,"SK112","Standard Boxer Knife",null,"Blue Only",615,"-","K112","-","T034","-",null,"P01",1,null,22.364812800000006,{"$f":"Q484*P484","v":0}]
[null,null,"SK116","Swan Bag Cutter",null,"Blue Only",615,"-","K116","-","T035","-",null,"P01",5,null,37.651200000000003,{"$f":"Q485*P485","v":0}]
[null,null,"SK117","Boxer Knife",null,"Blue Only",615,"-","K117","-","T196","-",null,"P01",5,null,42.161500000000004,{"$f":"Q486*P486","v":0}]
[null,null,null,"Type"]
[null,null,"SK118","Shark Knife , With Retracting Hook",null,"Blue Only",615,"-","K118","-","T197","-",null,"P01",1,null,{"$f":"((HLOOKUP(D488,'Coding and Prices'!A573:C574,2,0))*1.85)*1.06","v":25.091795088000005},{"$f":"Q488*P488","v":0}]
[null,null,"SK119","Rapid Retract",null,"Blue Only","615R","-","K119","-","T037","-",null,"P01",1,null,23.233143600000005,{"$f":"Q489*P489","v":0}]
[null,null,"SK120","Rapid Retract",null,"Blue Only","615R","-","K120","-","T037",null,null,"P01",1,null,30.391578000000003,{"$f":"Q490*P490","v":0}]
[]
[null,"Safety Knife Holster","Type",null,null,null,null,null,616,"-",{"$f":"HLOOKUP(C493,'Coding and Prices'!A576:C577,2,0)","v":"T073"},null,null,null,1,null,{"$f":"((HLOOKUP(C493,'Coding and Prices'!A579:C580,2,0))*1.85)*1.06","v":8.7146526240000011},{"$f":"P492*Q492","v":0}]
[null,null,"Suits SK102"]
[]
[null,"Safety Knife Storage","Type",null,null,null,null,null,617,"-",{"$f":"HLOOKUP(C496,'Coding and Prices'!A582:C583,2,0)","v":"T079"},null,null,null,1,null,{"$f":"((HLOOKUP(C496,'Coding and Prices'!A585:C586,2,0))*1.85)*1.06","v":13.952593440000003},{"$f":"P495*Q495","v":0}]
[null,null,"Safe Box"]
[]
[null,"Replacement Blades\n(For Safety Knives)"]
[null,null,"ST/ST Straight Blade","Type",null,null,618,"-","P32","-","K002","-",null,{"$f":"HLOOKUP(D500,'Coding and Prices'!A589:E590,2,0)","v":"T387"},10,null,{"$f":"((HLOOKUP(D500,'Coding and Prices'!A592:E593,2,0))*1.85)*1.06","v":11.177700000000002},{"$f":"Q499*P499","v":0}]
[null,null,null,"Suits SK118"]
[null,null,"ST/ST Industrial Cutter Blade","Type",null,null,618,"-","P44","-","K003","-",null,{"$f":"HLOOKUP(D502,'Coding and Prices'!A595:C596,2,0)","v":"T071"},10,null,8.8245000000000022,{"$f":"Q501*P501","v":0}]
[null,null,null,"Suits SK100"]
[null,null,"ST/ST Trapezoid Blade","Type",null,null,618,"-","P32","-","K005","-",null,{"$f":"HLOOKUP(D504,'Coding and Prices'!A598:D599,2,0)","v":"T036"},10,null,11.177700000000002,{"$f":"Q503*P503","v":0}]
[null,null,null,"Suits SK119"]
[null,null,"S/S Hook Blade","Suits SK109",null,null,618,"-","P32","-","K001","-",null,"TO75",10,null,7.6478999999999999,{"$f":"Q505*P505","v":0}]
[null,null,"Carbon Hook Blade","Suits SK111",null,null,618,"-","P40","-","K001","-",null,"T076",10,null,4.9024999999999999,{"$f":"Q506*P506","v":0}]
[null,null,"ST/ST Tape Scratcher","Suits SK101",null,null,618,"-","P32","-","K004","-",null,"T072",10,null,15.491900000000003,{"$f":"Q507*P507","v":0}]
[]
[]
[null,"Pocket Knife - Lockable \n(Stainless Steel)","Locking all purpose blade - 70mm","Attachment",null,null,null,null,606,"-","Q04","-",{"$f":"HLOOKUP(D511,'Coding and Prices'!A601:D602,2,0)","v":"T222"},null,1,null,{"$f":"((HLOOKUP(D511,'Coding and Prices'!A604:D605,2,0))*1.85)*1.06","v":31.404771792000005},{"$f":"P510*Q510","v":0}]
[null,null,null,"Fitted with shackle and wrist lanyard"]
[]
[null,"Pocket Knife - Lockable \n(Stainless Steel)","Curved pruner blade - 65mm","Attachment",null,null,null,null,606,"-","Q05","-",{"$f":"HLOOKUP(D514,'Coding and Prices'!A607:D608,2,0)","v":"T224"},null,1,null,{"$f":"((HLOOKUP(D514,'Coding and Prices'!A604:D605,2,0))*1.85)*1.06","v":29.025968976000005},{"$f":"P513*Q513","v":0}]
[null,null,null,"Fitted with shackle"]
[]
[null,"Pocket Knife  \n(Metal Detectable Lockable Handle)","Type",null,null,null,null,null,605,"-",{"$f":"HLOOKUP(C517,'Coding and Prices'!A613:E614,2,0)","v":"T043"},"-","P01",null,1,null,32.631040000000006,{"$f":"P516*Q516","v":0}]
[null,null,"Sheepfoot Blade"]
[]
[null,null,null,"Size",null,"Colour Handle"]
[null,"Plain Edged \nProfesional Knives\n(Metal Detectable Handle)","Wavy Edge Slicer","10\" (250mm)",null,"Blue",600,"-","T046","-",{"$f":"HLOOKUP(D520,'Coding and Prices'!L1098:Q1099,2,0)","v":"S072"},"-",null,{"$f":"HLOOKUP(F520,'Coding and Prices'!R1098:W1100,3,0)","v":"P01"},10,null,{"$f":"((HLOOKUP(D520,'Coding and Prices'!A1101:D1102,2,0))*1.85)*1.06","v":322.58449999999999},{"$f":"Q520*P520","v":0}]
[null,null,"Cooks Knife","6.25\" (158mm)",null,"Blue",600,"-","T047","-",{"$f":"HLOOKUP(D521,'Coding and Prices'!A1104:F1105,2,0)","v":"S877"},"-",null,{"$f":"HLOOKUP(F521,'Coding and Prices'!R1098:W1100,3,0)","v":"P01"},10,null,{"$f":"((HLOOKUP(D521,'Coding and Prices'!A1107:F1108,2,0))*1.85)*1.06","v":423.57600000000002},0]
[null,null,"Light Cooks Knife","6\" (150mm)",null,"Red",600,"-","T263","-",{"$f":"HLOOKUP(D522,'Coding and Prices'!A1166:F1167,2,0)","v":"S401"},"-",null,{"$f":"HLOOKUP(F522,'Coding and Prices'!R1098:W1100,3,0)","v":"P03"},10,null,{"$f":"((HLOOKUP(D522,'Coding and Prices'!A1169:F1170,2,0))*1.85)*1.06","v":335.91930000000002},{"$f":"Q522*P522","v":0}]
[null,null,"Broad Cooks Knife","10\" (250mm)",null,"Blue",600,"-","T397","-",{"$f":"HLOOKUP(D523,'Coding and Prices'!A1172:C1173,2,0)","v":"S072"},null,null,{"$f":"HLOOKUP(F523,'Coding and Prices'!R1098:W1100,3,0)","v":"P01"},10,null,{"$f":"((HLOOKUP(D523,'Coding and Prices'!A1175:C1176,2,0))*1.85)*1.06","v":607.91000000000008},{"$f":"Q523*P523","v":0}]
[null,null,"Butchers Knife","10\" (250mm)",null,"Blue",600,"-","T048","-",{"$f":"HLOOKUP(D524,'Coding and Prices'!A1110:C1111,2,0)","v":"S072"},"-",null,{"$f":"HLOOKUP(F524,'Coding and Prices'!R1098:W1100,3,0)","v":"P01"},10,null,{"$f":"((HLOOKUP(D524,'Coding and Prices'!A1113:C1114,2,0))*1.85)*1.06","v":713.80399999999997},0]
[null,null,"Scimitar Butchers Knife","6\" (150mm)",null,"Blue",600,"-","T109","-",{"$f":"HLOOKUP(D525,'Coding and Prices'!B1116:H1117,2,0)","v":"S401"},"-",null,{"$f":"HLOOKUP(F525,'Coding and Prices'!R1098:W1100,3,0)","v":"P01"},10,null,{"$f":"((HLOOKUP(D525,'Coding and Prices'!A1119:H1120,2,0))*1.85)*1.06","v":392.20000000000005},{"$f":"Q525*P525","v":0}]
[null,null,"Narrow Scimitar Steak Knife","8\" (203mm)",null,"Blue",600,"-","T398","-",{"$f":"HLOOKUP(D526,'Coding and Prices'!A1154:D1155,2,0)","v":"S071"},"-",null,{"$f":"HLOOKUP(F526,'Coding and Prices'!R1098:W1100,3,0)","v":"P01"},10,null,{"$f":"((HLOOKUP(D526,'Coding and Prices'!A1157:D1158,2,0))*1.85)*1.06","v":500.05500000000001},0]
[null,null,"Curved Scimitar Butchers Knife","10\" (250mm)",null,"Blue",600,"-","T393","-",{"$f":"HLOOKUP(D527,'Coding and Prices'!B1116:H1117,2,0)","v":"S072"},"-",null,{"$f":"HLOOKUP(F527,'Coding and Prices'!R1098:W1100,3,0)","v":"P01"},10,null,{"$f":"((HLOOKUP(D527,'Coding and Prices'!A1127:C1128,2,0))*1.85)*1.06","v":713.80399999999997},0]
[null,null,"Dagger Point Butchers Knife","10\" (250mm)",null,"Blue",600,"-","T395","-",{"$f":"HLOOKUP(D528,'Coding and Prices'!A1110:C1111,2,0)","v":"S072"},"-",null,{"$f":"HLOOKUP(F528,'Coding and Prices'!R1098:W1100,3,0)","v":"P01"},10,null,{"$f":"((HLOOKUP(D528,'Coding and Prices'!A1122:C1123,2,0))*1.85)*1.06","v":713.80399999999997},0]
[null,null,"Ergonomix Universal Butcher Knife","6\" (150mm)",null,"Blue",600,"-","T399","-","S401","-",null,{"$f":"HLOOKUP(F529,'Coding and Prices'!R1098:W1100,3,0)","v":"P01"},10,null,394.16100000000006,0]
[null,null,"Broad Curved Boning Knife","6\" (150mm)",null,"Blue",600,"-","T400","-","S401","-",null,{"$f":"HLOOKUP(F530,'Coding and Prices'!R1098:W1100,3,0)","v":"P01"},10,null,289.2475,0]
[null,null,"Curved Boning Knife","5\" (130mm)",null,"Blue",600,"-","T050","-",{"$f":"HLOOKUP(D531,'Coding and Prices'!A1130:C1131,2,0)","v":"S443"},"-",null,{"$f":"HLOOKUP(F531,'Coding and Prices'!R1098:W1100,3,0)","v":"P01"},10,null,{"$f":"((HLOOKUP(D531,'Coding and Prices'!A1133:C1134,2,0))*1.85)*1.06","v":301.99400000000003},0]
[null,null,"Boning Knife - Regular","5\" (130mm)",null,"Blue",600,"-","T052","-",{"$f":"HLOOKUP(D532,'Coding and Prices'!A1136:D1137,2,0)","v":"S443"},null,null,{"$f":"HLOOKUP(F532,'Coding and Prices'!R1098:W1100,3,0)","v":"P01"},10,null,{"$f":"((HLOOKUP(D532,'Coding and Prices'!A1139:D1140,2,0))*1.85)*1.06","v":301.99400000000003},0]
[null,null,"Boning Knife - Narrow","5\" (130mm)",null,"Blue",600,"-","T401","-",{"$f":"HLOOKUP(D533,'Coding and Prices'!A1130:C1131,2,0)","v":"S443"},"-",null,{"$f":"HLOOKUP(F533,'Coding and Prices'!R1098:W1100,3,0)","v":"P01"},10,null,{"$f":"((HLOOKUP(D533,'Coding and Prices'!A1145:C1146,2,0))*1.85)*1.06","v":301.99400000000003},0]
[null,null,"Skinning/Siding Knife","7\" (180mm)",null,"Blue",600,"-","T402","-",{"$f":"HLOOKUP(D534,'Coding and Prices'!A1148:C1149,2,0)","v":"S492"},"-",null,{"$f":"HLOOKUP(F534,'Coding and Prices'!R1098:W1100,3,0)","v":"P01"},10,null,{"$f":"((HLOOKUP(D534,'Coding and Prices'!A1151:C1152,2,0))*1.85)*1.06","v":392.20000000000005},0]
[null,null,"Filleting Knife - Narrow","6\" (150mm)",null,"Blue",600,"-","T057","-",{"$f":"HLOOKUP(D535,'Coding and Prices'!A1160:C1161,2,0)","v":"S401"},"-",null,{"$f":"HLOOKUP(F535,'Coding and Prices'!R1098:W1100,3,0)","v":"P01"},10,null,{"$f":"((HLOOKUP(D535,'Coding and Prices'!A1163:C1164,2,0))*1.85)*1.06","v":319.64300000000003},0]
[null,null,"Filleting Knife - Broad","6.5\" (160mm)",null,"Blue",600,"-","T053","-","S070","-",null,{"$f":"HLOOKUP(F536,'Coding and Prices'!R1098:W1100,3,0)","v":"P01"},10,null,319.64300000000003,0]
[null,null,"Mini-Parer Knife - Serrated","3\" (70m)",null,"Blue",600,"-","T180","-","S423","-",null,{"$f":"HLOOKUP(F537,'Coding and Prices'!R1098:W1100,3,0)","v":"P01"},10,null,95.69680000000001,0]
[null,null,"Vegatable Knife - Straight","3.5\" (90mm)",null,"Blue",600,"-","T067","-","S480","-",null,{"$f":"HLOOKUP(F538,'Coding and Prices'!R1098:W1100,3,0)","v":"P01"},10,null,120.60150000000002,0]
[null,null,"Vegatable Knife - Pointed","3.5\" (90mm)",null,"Blue",600,"-","T265","-","S480","-",null,{"$f":"HLOOKUP(F539,'Coding and Prices'!R1098:W1100,3,0)","v":"P01"},10,null,120.60150000000002,{"$f":"Q539*P539","v":0}]
[null,null,"Vegatable Knife - Serrated","4\" (100mm)",null,"Blue",600,"-","T403","-",{"$f":"HLOOKUP(D540,'Coding and Prices'!A1178:C1179,2,0)","v":"S068"},"-",null,{"$f":"HLOOKUP(F540,'Coding and Prices'!R1098:W1100,3,0)","v":"P01"},10,null,{"$f":"((HLOOKUP(D540,'Coding and Prices'!A1181:C1182,2,0))*1.85)*1.06","v":148.2516},{"$f":"Q540*P540","v":0}]
[null,null,"Vegatable Knife","3.5\" (90mm)",null,"Blue",600,"-","T054","-",{"$f":"HLOOKUP(D541,'Coding and Prices'!A1184:C1185,2,0)","v":"S480"},"-",null,{"$f":"HLOOKUP(F541,'Coding and Prices'!R1098:W1100,3,0)","v":"P01"},10,null,{"$f":"((HLOOKUP(D541,'Coding and Prices'!A1187:C1188,2,0))*1.85)*1.06","v":120.60150000000002},0]
[null,null,"Vegatable produce Knife  - Blunt End","6\" (150mm)",null,"Blue",600,"-","T039","-","S401","-",null,{"$f":"HLOOKUP(F542,'Coding and Prices'!R1098:W1100,3,0)","v":"P01"},10,null,272.18680000000006,0]
[null,null,"Kitchen Knife","5\" (130mm)",null,"Blue",600,"-","T264","-","S443","-",null,{"$f":"HLOOKUP(F543,'Coding and Prices'!R1098:W1100,3,0)","v":"P01"},10,null,132.75970000000001,0]
[null,null,"Palette Knife - Flexible ","6\" (150mm)",null,"Blue",600,"-","T051","-",{"$f":"HLOOKUP(D544,'Coding and Prices'!A1190:G1191,2,0)","v":"S401"},"-",null,{"$f":"HLOOKUP(F544,'Coding and Prices'!R1098:W1100,3,0)","v":"P01"},10,null,{"$f":"((HLOOKUP(D544,'Coding and Prices'!A1193:G1194,2,0))*1.85)*1.06","v":173.54849999999999},0]
[null,null,"Scoring Knife","2.5\" (60mm)",null,"Blue",600,"-","T083",null,"S425","-",null,{"$f":"HLOOKUP(F545,'Coding and Prices'!R1098:W1100,3,0)","v":"P01"},10,null,160.80200000000002,0]
[null,null,"Sandwich Spreader","3.5\" (90mm)",null,"Blue",600,"-","T404","-","S480","-",null,{"$f":"HLOOKUP(F546,'Coding and Prices'!R1098:W1100,3,0)","v":"P01"},10,null,160.80200000000002,0]
[null,null,"Artist Palette - Flexible","6\" (150mm)",null,"Blue",600,"-","T086","-",{"$f":"HLOOKUP(D547,'Coding and Prices'!A1196:D1197,2,0)","v":"S401"},"-",null,{"$f":"HLOOKUP(F547,'Coding and Prices'!R1098:W1100,3,0)","v":"P01"},10,null,{"$f":"((HLOOKUP(D547,'Coding and Prices'!A1199:D1200,2,0))*1.85)*1.06","v":190.60920000000004},0]
[null,null,"Griddle Scraper","5\" (130mm)",null,"Blue",600,"-","T082","-","S443","-",null,{"$f":"HLOOKUP(F548,'Coding and Prices'!R1098:W1100,3,0)","v":"P01"},10,null,285.91380000000004,0]
[null,null,"Japanese / China Knife","8\" (203mm)",null,"Blue",600,"-","T421","-","S071","-",null,{"$f":"HLOOKUP(F549,'Coding and Prices'!R1098:W1100,3,0)","v":"P01"},10,null,459.46230000000008,0]
[null,null,"Dough Knife","8\" (203mm)",null,"Blue",600,"-","T084","-","S071","-",null,{"$f":"HLOOKUP(F550,'Coding and Prices'!R1098:W1100,3,0)","v":"P01"},10,null,458.87400000000008,0]
[null,null,"Forged Cooks Knife - No Rivets ","3\" (70m)",null,"Blue",600,"-","T422","-",{"$f":"HLOOKUP(D551,'Coding and Prices'!A1202:D1203,2,0)","v":"S423"},"-",null,{"$f":"HLOOKUP(F551,'Coding and Prices'!R1098:W1100,3,0)","v":"P01"},10,null,{"$f":"((HLOOKUP(D551,'Coding and Prices'!A1205:D1206,2,0))*1.85)*1.06","v":518.88060000000007},0]
[null,null,"Forged Cooks Knife - With Rivets ","4\" (100mm)",null,"Blue",600,"-","T423","-",{"$f":"HLOOKUP(D552,'Coding and Prices'!A1208:E1209,2,0)","v":"S068"},"-",null,{"$f":"HLOOKUP(F552,'Coding and Prices'!R1098:W1100,3,0)","v":"P01"},10,null,{"$f":"((HLOOKUP(D552,'Coding and Prices'!A1211:E1212,2,0))*1.85)*1.06","v":614.18520000000001},0]
[]
[null,"Scallop Edged\nProfesional Knives\n(Metal Detectable Handle)",null,"Size",null,"Colour Handle"]
[null,null,"Broad Curved Boning Knife","6\" (150mm)",null,"Blue",600,"-","T405","-","S401","-",null,{"$f":"HLOOKUP(F555,'Coding and Prices'!R1098:W1100,3,0)","v":"P01"},10,null,347.29309999999998,{"$f":"Q555*P555","v":0}]
[null,null,"Curved Boning Knife","5\" (130mm)",null,"Blue",600,"-","T406","-",{"$f":"HLOOKUP(D556,'Coding and Prices'!A1245:C1246,2,0)","v":"S443"},"-",null,{"$f":"HLOOKUP(F556,'Coding and Prices'!R1098:W1100,3,0)","v":"P01"},10,null,{"$f":"((HLOOKUP(D556,'Coding and Prices'!A1248:C1249,2,0))*1.85)*1.06","v":328.27140000000003},{"$f":"Q556*P556","v":0}]
[null,null,"Boning Knife - Regular","5\" (130mm)",null,"Blue",600,"-","T408","-",{"$f":"HLOOKUP(D557,'Coding and Prices'!A1251:D1252,2,0)","v":"S443"},"-",null,{"$f":"HLOOKUP(F557,'Coding and Prices'!R1098:W1100,3,0)","v":"P01"},10,null,{"$f":"((HLOOKUP(D557,'Coding and Prices'!A1254:D1255,2,0))*1.85)*1.06","v":328.27140000000003},{"$f":"Q557*P557","v":0}]
[null,null,"Boning Knife - Narrow","5\" (130mm)",null,"Blue",600,"-","T407","-",{"$f":"HLOOKUP(D558,'Coding and Prices'!A1257:C1258,2,0)","v":"S443"},"-",null,{"$f":"HLOOKUP(F558,'Coding and Prices'!R1098:W1100,3,0)","v":"P01"},10,null,{"$f":"((HLOOKUP(D558,'Coding and Prices'!A1260:C1261,2,0))*1.85)*1.06","v":301.99400000000003},{"$f":"Q558*P558","v":0}]
[null,null,"Ergonomix Universal Butcher Knife","6\" (150mm)",null,"Blue",600,"-","T409","-","S401","-",null,{"$f":"HLOOKUP(F559,'Coding and Prices'!R1098:W1100,3,0)","v":"P01"},10,null,254.93,{"$f":"Q559*P559","v":0}]
[null,null,"Butchers Knife","10\" (250mm)",null,"Blue",600,"-","T410","-",{"$f":"HLOOKUP(D560,'Coding and Prices'!A1225:C1226,2,0)","v":"S072"},"-",null,{"$f":"HLOOKUP(F560,'Coding and Prices'!R1098:W1100,3,0)","v":"P01"},10,null,{"$f":"((HLOOKUP(D560,'Coding and Prices'!A1228:C1229,2,0))*1.85)*1.06","v":773.02620000000002},0]
[null,null,"Dagger Point Butchers Knife","10\" (250mm)",null,"Blue",600,"-","T396","-",{"$f":"HLOOKUP(D561,'Coding and Prices'!A1240:C1241,2,0)","v":"S072"},"-",null,{"$f":"HLOOKUP(F561,'Coding and Prices'!R1098:W1100,3,0)","v":"P01"},10,null,{"$f":"((HLOOKUP(D561,'Coding and Prices'!A1237:C1238,2,0))*1.85)*1.06","v":773.02620000000002},0]
[null,null,"Curved Scimitar Butchers Knife","10\" (250mm)",null,"Blue",600,"-","T394","-",{"$f":"HLOOKUP(D562,'Coding and Prices'!A1240:C1241,2,0)","v":"S072"},"-",null,{"$f":"HLOOKUP(F562,'Coding and Prices'!R1098:W1100,3,0)","v":"P01"},10,null,{"$f":"((HLOOKUP(D562,'Coding and Prices'!A1242:C1243,2,0))*1.85)*1.06","v":773.02620000000002},0]
[null,null,"Narrow Scimitar Steak Knife","8\" (203mm)",null,"Blue",600,"-","T412","-",{"$f":"HLOOKUP(D563,'Coding and Prices'!A1263:D1264,2,0)","v":"S071"},"-",null,{"$f":"HLOOKUP(F563,'Coding and Prices'!R1098:W1100,3,0)","v":"P01"},10,null,{"$f":"((HLOOKUP(D563,'Coding and Prices'!A1266:D1267,2,0))*1.85)*1.06","v":556.92399999999998},0]
[null,null,"Scimitar Butchers Knife","6\" (150mm)",null,"Blue",600,"-","T411","-",{"$f":"HLOOKUP(D564,'Coding and Prices'!A1231:H1232,2,0)","v":"S401"},"-",null,{"$f":"HLOOKUP(F564,'Coding and Prices'!R1098:W1100,3,0)","v":"P01"},10,null,{"$f":"((HLOOKUP(D564,'Coding and Prices'!A1234:H1235,2,0))*1.85)*1.06","v":440.24450000000007},0]
[null,null,"Vegatable Knife - Straight","3.5\" (90mm)",null,"Blue",600,"-","T413","-","S480","-",null,{"$f":"HLOOKUP(F565,'Coding and Prices'!R1098:W1100,3,0)","v":"P01"},10,null,154.91900000000001,{"$f":"Q565*P565","v":0}]
[null,null,"Vegatable Knife - Pointed","3.5\" (90mm)",null,"Blue",600,"-","T414","-","S480","-",null,{"$f":"HLOOKUP(F566,'Coding and Prices'!R1098:W1100,3,0)","v":"P01"},10,null,154.91900000000001,0]
[null,null,"Vegatable Knife","4\" (100mm)",null,"Blue",600,"-","T415","-",{"$f":"HLOOKUP(D567,'Coding and Prices'!A1184:C1185,2,0)","v":"S068"},"-",null,{"$f":"HLOOKUP(F567,'Coding and Prices'!R1098:W1100,3,0)","v":"P01"},10,null,{"$f":"((HLOOKUP(D567,'Coding and Prices'!A1272:C1273,2,0))*1.85)*1.06","v":172.56800000000001},0]
[null,null,"Vegatable Produce Knife","6\" (150mm)",null,"Blue",600,"-","T416","-","S401","-",null,{"$f":"HLOOKUP(F568,'Coding and Prices'!R1098:W1100,3,0)","v":"P01"},10,null,315.52490000000006,0]
[null,null,"Kitchen Knife","5\" (130mm)",null,"Blue",600,"-","T417","-","S443","-",null,{"$f":"HLOOKUP(F569,'Coding and Prices'!R1098:W1100,3,0)","v":"P01"},10,null,177.86270000000002,0]
[null,null,"Bread Knife","8\" (203mm)",null,"Blue",600,"-","T108","-","S071","-",null,{"$f":"HLOOKUP(F570,'Coding and Prices'!R1098:W1100,3,0)","v":"P01"},10,null,375.9237,0]
[null,null,"Counter Knife","10\" (250mm)",null,"Blue",600,"-","T049","-",{"$f":"HLOOKUP(D571,'Coding and Prices'!A1275:C1276,2,0)","v":"S072"},"-",null,{"$f":"HLOOKUP(F571,'Coding and Prices'!R1098:W1100,3,0)","v":"P01"},10,null,{"$f":"((HLOOKUP(D571,'Coding and Prices'!A1278:C1279,2,0))*1.85)*1.06","v":421.61500000000001},0]
[null,null,"Cooks Knife","7.5\" (190mm)",null,"Blue",600,"-","T418","-",{"$f":"HLOOKUP(D572,'Coding and Prices'!A1219:F1220,2,0)","v":"S878"},"-",null,{"$f":"HLOOKUP(F572,'Coding and Prices'!R1098:W1100,3,0)","v":"P01"},10,null,{"$f":"((HLOOKUP(D572,'Coding and Prices'!A1222:F1223,2,0))*1.85)*1.06","v":505.93800000000005},{"$f":"Q572*P572","v":0}]
[null,null,"Ham / Smoked Salmon Slicer","8\" (203mm)",null,"Blue",600,"-","T419","-",{"$f":"HLOOKUP(D573,'Coding and Prices'!A1281:F1282,2,0)","v":"S071"},"-",null,{"$f":"HLOOKUP(F573,'Coding and Prices'!R1098:W1100,3,0)","v":"P01"},10,null,{"$f":"((HLOOKUP(D573,'Coding and Prices'!A1284:F1285,2,0))*1.85)*1.06","v":339.25300000000004},{"$f":"Q573*P573","v":0}]
[null,null,"Beef Slicer","8\" (203mm)",null,"Blue",600,"-","T420","-",{"$f":"HLOOKUP(D574,'Coding and Prices'!A1281:F1282,2,0)","v":"S071"},"-",null,{"$f":"HLOOKUP(F574,'Coding and Prices'!R1098:W1100,3,0)","v":"P01"},10,null,{"$f":"((HLOOKUP(D574,'Coding and Prices'!A1284:F1285,2,0))*1.85)*1.06","v":339.25300000000004},{"$f":"Q574*P574","v":0}]
[]
[null,"Hammer/Mallet\n(Detectable Head)","Size","Blue Detectable Head",null,null,null,null,810,"-",{"$f":"HLOOKUP(C577,'Coding and Prices'!A687:D688,2,0)","v":"S066"},"-",null,"P01",1,null,{"$f":"((HLOOKUP(C577,'Coding and Prices'!A690:D691,2,0))*1.85)*1.06","v":65.06598000000001},{"$f":"P576*Q576","v":0}]
[null,null,"76mm diameter head"]
[]
[null,"Detectable Bob Weight ",null,null,null,null,null,null,980,"-","P01",null,null,null,1,null,27.434390000000004,{"$f":"P579*Q579","v":0}]
[]
[]
[null,"Keyhole Tags\n(Metal Detectable)","Roll Size","Colour",null,null,555,"-",{"$f":"HLOOKUP(D583,'Coding and Prices'!A616:M618,3,0)","v":"P01"},"-",{"$f":"HLOOKUP(C583,'Coding and Prices'!A616:C618,2,0)","v":"S119"},"-",null,"X17",1,null,{"$f":"((HLOOKUP(C583,'Coding and Prices'!A620:C621,2,0))*1.85)*1.06","v":55.888500000000008},{"$f":"P582*Q582","v":0}]
[null,null,"25 x 190mm (1 x 7.5\")","Blue"]
[]
[null,"High Heat Keyhole Tags\n(Metal Detectable)","Roll Size","Colour",null,null,555,"-",{"$f":"HLOOKUP(D586,'Coding and Prices'!A635:C636,2,0)","v":"P01"},"-","S399","-",null,"X17",1,null,121.56239000000002,{"$f":"P585*Q585","v":0}]
[null,null,"50 x 279mm","Blue"]
[]
[null,"Keyhole Tag Dispenser\n(Stainless Steel)","Single Slot","Type",null,null,null,null,558,"-",{"$f":"HLOOKUP(D589,'Coding and Prices'!A623:C624,2,0)","v":"S176"},null,null,null,1,null,{"$f":"((HLOOKUP(D589,'Coding and Prices'!A626:C627,2,0))*1.85)*1.06","v":126.07654924800001},{"$f":"P588*Q588","v":0}]
[null,null,null,"Suit large keyhole tags"]
[]
[null,"Keyhole Tag Dispenser\n(Stainless Steel)","8 Slot Multi ","Type",null,null,null,null,558,"-",{"$f":"HLOOKUP(D592,'Coding and Prices'!A629:C630,2,0)","v":"S178"},null,null,null,1,null,{"$f":"((HLOOKUP(D592,'Coding and Prices'!A632:C633,2,0))*1.85)*1.06","v":188.79460041600007},{"$f":"P591*Q591","v":0}]
[null,null,null,"Suit large keyhole tags"]
[]
[null,"Super X - Plastic ID Tags \n(Detectable)","Colour",null,null,null,550,"-","A65","-",{"$f":"HLOOKUP(C595,'Coding and Prices'!A638:I639,2,0)","v":"P02"},"-",null,"S074",25,null,36.278500000000001,{"$f":"P594*Q594","v":0}]
[null,null,"Black"]
[]
[null,"Plastic Tags Numbered Tags 1-100\n(Detectable)","Colour",null,null,null,549,"-",{"$f":"HLOOKUP(C598,'Coding and Prices'!A638:I639,2,0)","v":"P01"},"-","S441","-",null,"X21",100,null,290.14956000000006,{"$f":"P597*Q597","v":0}]
[null,null,"Blue"]
[]
[null,"Reusable Plastic ID Tags \n(Detectable)","85 mm diameter x 3.2mm thick","Type",null,"Blue Only",null,null,213,"-","P01","-",null,{"$f":"HLOOKUP(D601,'Coding and Prices'!A641:D642,2,0)","v":"S437"},10,null,{"$f":"((HLOOKUP(D601,'Coding and Prices'!A644:D645,2,0))*1.85)*1.06","v":34.121400000000001},{"$f":"P600*Q600","v":0}]
[null,null,null,"Drilled with split ring"]
[]
[null,"Reusable Plastic ID Tags \n(Detectable)","110 mm diameter x 3.2mm thick","Type",null,"Blue Only",null,null,213,"-","P01","-",null,{"$f":"HLOOKUP(D604,'Coding and Prices'!A647:D648,2,0)","v":"S438"},10,null,{"$f":"((HLOOKUP(D604,'Coding and Prices'!A650:D651,2,0))*1.85)*1.06","v":37.651200000000003},{"$f":"P603*Q603","v":0}]
[null,null,null,"Undrilled"]
[]
[null,"Reusable Plastic Signs\n(Detectable)","Colour",null,null,null,null,null,213,"-",{"$f":"HLOOKUP(C607,'Coding and Prices'!A1090:J1091,2,0)","v":"P01"},"-",null,"S476",10,null,46.063890000000001,{"$f":"P606*Q606","v":0}]
[null,null,"Blue"]
[]
[null,"Lock Out Sign / ID Tags\n(Detectable)","Colour",null,null,null,null,null,213,"-",{"$f":"HLOOKUP(C610,'Coding and Prices'!A1090:J1091,2,0)","v":"P01"},"-",null,"S510",10,null,84.185730000000007,{"$f":"Q609*P609","v":0}]
[null,null,"Blue"]
[]
[null,"Detectable Health & Safety Signs\n(Detectable)","Size","Colour","Type",null,380,"-",{"$f":"HLOOKUP(C613,'Coding and Prices'!A1300:D1301,2,0)","v":"S04"},"-",{"$f":"HLOOKUP(D613,'Coding and Prices'!A1300:M1302,3,0)","v":"P01"},"-",null,{"$f":"HLOOKUP(E613,'Coding and Prices'!A1300:W1303,4,0)","v":"L10"},1,null,{"$f":"((HLOOKUP(C613,'Coding and Prices'!A1306:D1307,2,0))*1.85)*1.06","v":17.4529},{"$f":"Q612*P612","v":0}]
[null,null,"A4","Blue","Wear Protective Gloves"]
[]
[null,"Cable Ties - with st/st lock\n(Detectable)","Type","Size",null,null,800,"-",{"$f":"HLOOKUP(C616,'Coding and Prices'!A696:G698,2,0)","v":"CT08"},"-",{"$f":"HLOOKUP(D616,'Coding and Prices'!A696:G698,3,0)","v":"S139"},"-",null,"X39",100,null,{"$f":"((INDEX('Coding and Prices'!A700:E702,MATCH('Price List'!C616,'Coding and Prices'!A700:A702,0),MATCH('Price List'!D616,'Coding and Prices'!A700:E700,0)))*1.85)*1.06","v":19.021700000000003},{"$f":"P615*Q615","v":0}]
[null,null,"Blue Polypropylene","L - 92mm x W - 2.4mm"]
[]
[null,"Cable Ties - Blue Nylon\n(Detectable)","Size",null,null,null,800,"-","CT03","-",{"$f":"HLOOKUP(C619,'Coding and Prices'!A704:H705,2,0)","v":"S139"},"-",null,"X39",100,null,{"$f":"((HLOOKUP(C619,'Coding and Prices'!A707:H708,2,0))*1.85)*1.06","v":7.8440000000000012},{"$f":"P618*Q618","v":0}]
[null,null,"L - 92mm x W - 2.4mm"]
[]
[null,"Cable Ties - Nylon\n(Detectable)","Colour","L - 390mm x W - 4.6mm",null,null,800,"-",{"$f":"HLOOKUP(C622,'Coding and Prices'!A1073:F1074,2,0)","v":"CT05"},"-","S126","-",null,"X39",100,null,23.532000000000004,{"$f":"P621*Q621","v":0}]
[null,null,"Red"]
[]
[null,"Cable Ties - Reusable\n(Detectable)","L - 250mm x W - 4.7mm","Blue Nylon",null,null,800,"-","CT02","-","S120","-",null,"X39",100,null,21.571000000000002,{"$f":"P624*Q624","v":0}]
[]
[]
[null,"Zip Ties\n(Detectable)","Type",null,null,null,809,"-","CT10","-",{"$f":"HLOOKUP(C628,'Coding and Prices'!A1477:G1478,2,0)","v":"S593"},"-",null,"X11",100,null,{"$f":"HLOOKUP(C628,'Coding and Prices'!A1480:G1481,2,0)","v":6.55},{"$f":"P627*Q627","v":0}]
[null,null,"Length 4\" (101.6mm) , Tensile Strength 18lb"]
[]
[null,"Screw Mounts\n(Detectable)","Type",null,null,null,null,null,813,"-",{"$f":"HLOOKUP(C631,'Coding and Prices'!A1483:F1484,2,0)","v":"S600"},"-",null,"X11",100,null,{"$f":"HLOOKUP(C631,'Coding and Prices'!A1486:F1487,2,0)","v":8.3000000000000007},{"$f":"P630*Q630","v":0}]
[null,null,"#6  - Thread dia 0.13\""]
[]
[null,"Zip Tie Mounting Pad\n(Detectable)","Type",null,null,null,null,null,814,"-",{"$f":"HLOOKUP(C634,'Coding and Prices'!A1489:E1490,2,0)","v":"S426"},"-",null,"X11",100,null,{"$f":"HLOOKUP(C634,'Coding and Prices'!A1492:E1493,2,0)","v":16.7},{"$f":"P633*Q633","v":0}]
[null,null,"1\" (25.4mm)"]
[]
[null,"Cable Tie Mounts\n(Detectable)","Type","Blue Nylon",null,null,null,null,808,"-",{"$f":"HLOOKUP(C637,'Coding and Prices'!A1464:C1465,2,0)","v":"S037"},"-",null,"X11",100,null,{"$f":"((HLOOKUP(C637,'Coding and Prices'!A1467:C1468,2,0))*1.85)*1.06","v":69.39979000000001},{"$f":"P636*Q636","v":0}]
[null,null,"4.0mm hole dia"]
[]
[null,"Silicone Rubber Sheet","Sheet Size 2m x 1m\n(longer lengths available POA)","Size",null,null,null,null,815,"-",{"$f":"HLOOKUP(D640,'Coding and Prices'!A1076:F1077,2,0)","v":"S148"},"-",null,"P01",1,null,{"$f":"((HLOOKUP(D640,'Coding and Prices'!A1079:F1080,2,0))*1.85)*1.06","v":440.37078840000009},{"$f":"P639*Q639","v":0}]
[null,null,null,"2000 x 1000 x 1.5 mm (1.8 kg/m)"]
[null,"Storage Equipment"]
["`"]
[null,"Detectable Stackable Trays","Attachment","Colour",null,null,null,null,"534S","-",{"$f":"HLOOKUP(C644,'Coding and Prices'!A1457:D1458,2,0)","v":"A40"},"-",{"$f":"HLOOKUP(D644,'Coding and Prices'!E1457:H1459,3,0)","v":"P01"},null,1,null,{"$f":"((HLOOKUP(C644,'Coding and Prices'!A1461:D1462,2,0))*1.85)*1.06","v":35.278390000000002},{"$f":"P643*Q643","v":0}]
[null,null,"Tray complete with Lid","Blue"]
[]
[null,"Non Detectable Stackable Trays","Attachment","Colour",null,null,null,null,"534N","-",{"$f":"HLOOKUP(C647,'Coding and Prices'!A1470:D1471,2,0)","v":"A40"},"-",{"$f":"HLOOKUP(D647,'Coding and Prices'!E1470:I1472,3,0)","v":"P01"},null,1,null,{"$f":"((HLOOKUP(C647,'Coding and Prices'!A1474:D1476,2,0))*1.85)*1.06","v":16.668500000000002},{"$f":"P646*Q646","v":0}]
[null,null,"Tray complete with Lid","Blue"]
[]
[null,"Rectangular Storage Container","L-180mm x W-120 x D-80mm","Blue",null,null,null,null,507,"-","S145","-","P01",null,5,null,49.515250000000009,{"$f":"P649*Q649","v":0}]
[]
[]
[null,"Square Storage Container","L-110mm x W-110 x D-73mm","Blue",null,null,null,null,508,"-","S140","-","P01",null,5,null,38.533650000000002,{"$f":"P652*Q652","v":0}]
[]
[]
[null,"Detectable Catering Bins","Type","Capacity",null,null,null,null,539,"-",{"$f":"HLOOKUP(D656,'Coding and Prices'!A409:J411,3,0)","v":"S205"},"-",{"$f":"HLOOKUP(C656,'Coding and Prices'!A409:C410,2,0)","v":"A131"},null,1,null,{"$f":"((INDEX('Coding and Prices'!A413:H415,MATCH('Price List'!C656,'Coding and Prices'!A413:A415,0),MATCH('Price List'!D656,'Coding and Prices'!A413:H413,0)))*1.85)*1.06","v":209.58625195200003},{"$f":"P655*Q655","v":0}]
[null,null,"Without Castors/ Wheels","160 Litre"]
[]
[null,"Detectable Catering Bin Lids","Size / Capacity",null,null,null,null,null,539,"-","A65","-",{"$f":"HLOOKUP(C659,'Coding and Prices'!A417:C418,2,0)","v":"S245"},null,1,null,56.417970000000004,{"$f":"P658*Q658","v":0}]
[null,null,"100 Litre "]
[]
[null,"Detectable Airtight Bowl","Type","Blue",null,null,516,"-",{"$f":"HLOOKUP(C662,'Coding and Prices'!A456:C457,2,0)","v":"Z01"},"-","P01","-","A40",null,1,null,{"$f":"((HLOOKUP(C662,'Coding and Prices'!A459:C460,2,0))*1.85)*1.06","v":16.651619712000002},{"$f":"P661*Q661","v":0}]
[null,null,"Round Bowl"]
[]
[null,"Stackable File Pockets/Holder - A4\n(Detectable and wall mountable)","Orientation ","Colour",null,null,null,null,322,"-",{"$f":"HLOOKUP(D665,'Coding and Prices'!A464:L466,3,0)","v":"P04"},"-",{"$f":"HLOOKUP(C665,'Coding and Prices'!A464:C465,2,0)","v":"O06"},null,1,null,17.55095,{"$f":"P664*Q664","v":0}]
[null,null,"Portrait","Green"]
[]
[null,"Small Detectable Storage Box ","L-164mm x W-103mm x D-30mm","Colour",null,null,500,"-","S089","-",{"$f":"HLOOKUP(D668,'Coding and Prices'!B468:C469,2,0)","v":"P01"},"-","S143",null,1,null,4.392640000000001,{"$f":"P667*Q667","v":0}]
[null,null,null,"Blue"]
[]
[null,"Detectable Storage Box \n(Blue)","With lid and locking clips","L-220mm x W-145mm x D-45mm",null,null,null,null,503,"-","P01","-","A42",null,1,null,12.118980000000001,{"$f":"P670*Q670","v":0}]
[]
[]
[null,"Storage Trays \n(Detectable)","Type","Colour",null,null,506,"-",{"$f":"HLOOKUP(C674,'Coding and Prices'!A653:C654,2,0)","v":"T163"},"-","S156","-",{"$f":"HLOOKUP(D674,'Coding and Prices'!A653:G655,3,0)","v":"P05"},null,1,null,{"$f":"((HLOOKUP(C674,'Coding and Prices'!A657:C658,2,0))*1.85)*1.06","v":32.594173200000007},{"$f":"P673*Q673","v":0}]
[null,null,"Non Stackable - Large","Yellow"]
[]
[null,"Bespoke Shadow Boards","Made to order"]
[]
[null,"Other Storage/ Handling Equipment"]
[]
[null,"Detectable Bag Sealer/Gripper","Length 245mm",null,null,null,null,null,805,"-","S231","-","T098",null,5,null,102.5603,{"$f":"Q680*P680","v":0}]
[]
[]
[null,"Detectable Cable Tidy","Size","30 metre rolls",null,null,null,null,803,"-",{"$f":"HLOOKUP(C684,'Coding and Prices'!A444:D445,2,0)","v":"S233"},"-","P01",null,1,null,{"$f":"((HLOOKUP(C684,'Coding and Prices'!A447:D448,2,0))*1.85)*1.06","v":226.21499856000005},{"$f":"Q683*P683","v":0}]
[null,null,"16mm diameter"]
[]
[null,"Detect-a-Clamp \n(releasable/ re-usable cable clamp)","Size",null,null,null,null,null,803,"-",{"$f":"HLOOKUP(C687,'Coding and Prices'!A450:C451,2,0)","v":"S089"},"-","T020",null,2,null,{"$f":"((HLOOKUP(C687,'Coding and Prices'!A453:C454,2,0))*1.85)*1.06","v":11.373800000000001},{"$f":"Q686*P686","v":0}]
[null,null,"Small"]
[]
[null,"Detectamate - Screw/ nail holder \n","Size",null,null,null,null,null,801,"-",{"$f":"HLOOKUP(C690,'Coding and Prices'!A681:D682,2,0)","v":"S089"},"-","P01",null,50,null,{"$f":"((HLOOKUP(C690,'Coding and Prices'!A684:D685,2,0))*1.85)*1.06","v":21.571000000000002},{"$f":"Q689*P689","v":0}]
[null,null,"Small"]
[]
[null,"Detectable Closure Clip","Length 362mm","Sealing Length 320mm",null,null,null,null,804,"-","S236",null,null,null,1,null,21.920058000000001,{"$f":"Q692*P692","v":0}]
[]
[]
[null,"Detectable Prover Pockets","168mm x 187mm x 85mm ",null,null,null,null,null,804,"-","S236",null,null,null,1,null,13.660326000000003,{"$f":"Q695*P695","v":0}]
[]
[]
[null,"Detectable Tote Bin Covers \n(Roll size 250 covers)","830mm x 620mm x 38 micron","Colour"]
[null,null,null,"Blue","1- 50 Rolls",null,545,"-","A65",null,{"$f":"HLOOKUP(D699,'Coding and Prices'!A471:E472,2,0)","v":"P01"},"-",null,"X34",1,null,107.855,{"$f":"Q699*P699","v":0}]
[null,null,null,"Blue","50+ Rolls",null,545,"-","A65",null,{"$f":"HLOOKUP(D700,'Coding and Prices'!A471:E472,2,0)","v":"P01"},"-",null,"X34",1,null,98.050000000000011,{"$f":"Q700*P700","v":0}]
[null,null,null,null,null,null,null,null,null,null,null,null,null,null,null,null,"UNIT PRICE"]
[null,"Non Detectable Tote Bin Covers \n(Roll size 250 covers)","830mm x 620mm x 38 micron","Colour"]
[null,null,null,"Blue","1- 50 Rolls",null,545,"-","A66","-",{"$f":"HLOOKUP(D703,'Coding and Prices'!B471:E472,2,0)","v":"P01"},"-",null,"X34",1,null,68.635000000000005,{"$f":"Q703*P703","v":0}]
[null,null,null,"Blue","50+ Rolls",null,545,"-","A66","-",{"$f":"HLOOKUP(D704,'Coding and Prices'!B471:E472,2,0)","v":"P01"},"-",null,"X34",1,null,62.75200000000001,{"$f":"Q704*P704","v":0}]
[]
[null,"Stainless Steel Tote Bin \nCover Dispenser ","Suits all tote bin covers",null,null,null,null,null,589,"-","T198",null,null,null,1,null,429.50606400000009,{"$f":"Q706*P706","v":0}]
[]
[]
[null," Detectable Pallet Wrap\n(Stretch Wrap)","Size","Blue",null,null,null,null,546,"-",{"$f":"HLOOKUP(C710,'Coding and Prices'!A474:C475,2,0)","v":"S228"},"-","P01",null,null,null,{"$f":"((HLOOKUP(C710,'Coding and Prices'!A477:C478,2,0))*1.85)*1.06","v":252.15309849600001},{"$f":"Q709*P709","v":0}]
[null,null,"800mtr x500mm x 30micron 12.2kg"]
[]
[null,"Detectable Stretch Wrap Tape","50mm x 65 metres x 25micron ","Blue",null,null,null,null,547,"-","S147",null,null,null,1,null,10.059930000000003,{"$f":"Q712*P712","v":0}]
[]
[]
[null,"Metal Detectable Bags","Available in all Colours","Made to order Bespoke sizes",null,null,null,null,871,"-","P01","-",null,"S581",1,null,null,{"$f":"Q715*P715","v":0}]
[]
[]
[null,"Detectable Rubber Bands","80 x 6 x 1mm","Pack Quantity",null,null,null,null,821,"-","S161","-",null,{"$f":"HLOOKUP(D719,'Coding and Prices'!A480:C481,2,0)","v":"X13"},null,null,{"$f":"((HLOOKUP(D719,'Coding and Prices'!A483:C484,2,0))*1.85)*1.06","v":104.48433907200003},{"$f":"Q718*P718","v":0}]
[null,null,null,"Bulk pack of 600"]
[]
[null,"Detectable Rubber Bands","70 x 6 x 1mm","Pack Quantity",null,null,null,null,821,"-","S161","-",null,{"$f":"HLOOKUP(D722,'Coding and Prices'!A486:C487,2,0)","v":"X09"},null,null,{"$f":"((HLOOKUP(D722,'Coding and Prices'!A489:C490,2,0))*1.85)*1.06","v":9.1492416000000016},{"$f":"Q721*P721","v":0}]
[null,null,null,"Pack of 50"]
[]
[null,"Detectable Rubber Bands","60 x 6 x 1mm","Pack Quantity",null,null,null,null,821,"-","S161","-",null,{"$f":"HLOOKUP(D725,'Coding and Prices'!A492:C493,2,0)","v":"X09"},null,null,{"$f":"((HLOOKUP(D725,'Coding and Prices'!A495:C496,2,0))*1.85)*1.06","v":9.0348760800000019},{"$f":"Q724*P724","v":0}]
[null,null,null,"Pack of 50"]
[]
[null,"Sampling Cup","Blue",null,null,null,null,null,502,"-","T208",null,null,null,10,null,20.002200000000002,{"$f":"Q727*P727","v":0}]
[]
[]
[null,"Sampling Beaker","Blue",null,null,null,null,null,502,"-","T200",null,null,null,10,null,16.864599999999999,{"$f":"Q730*P730","v":0}]
[]
[]
[null,"Sampling Cutlery","Type","Blue Only",null,null,null,null,{"$f":"HLOOKUP(C734,'Coding and Prices'!A778:D779,2,0)","v":529},"-","P01",null,null,null,10,null,6.2752000000000008,{"$f":"Q733*P733","v":0}]
[null,null,"Fork"]
[]
[null,"Sampling Plate","Blue",null,null,null,null,null,537,"-","P01",null,null,null,10,null,19.399999999999999,{"$f":"Q736*P736","v":0}]
[]
[]
[null,"Detectasil\n(Detectable Silicone Sealant)","310ml tube","Colour Sealant",null,null,null,null,820,"-",{"$f":"HLOOKUP(D740,'Coding and Prices'!A693:C694,2,0)","v":"P06"},null,null,null,10,null,24.512500000000003,{"$f":"Q739*P739","v":0}]
[null,null,null,"White"]
[]
[null,"Steri - 99.9 Wipes \n(Fully detectable container with lid)","Container Only","Type",null,"Colour",null,null,433,"-",{"$f":"HLOOKUP(D743,'Coding and Prices'!A499:C500,2,0)","v":"S089"},"-",null,{"$f":"HLOOKUP(F743,'Coding and Prices'!A499:G501,3,0)","v":"P05"},1,null,{"$f":"((HLOOKUP(D743,'Coding and Prices'!A503:C504,2,0))*1.85)*1.06","v":4.5288745920000002},{"$f":"Q742*P742","v":0}]
[null,null,null,"Suit probe wipes",null,"Yellow"]
[]
[null,"Steri - 99.9 Wipes \n(Fully detectable container with lid)","With Wipe Refill","Type",null,"Colour",432,"-",{"$f":"HLOOKUP(D746,'Coding and Prices'!A506:C507,2,0)","v":"T280"},"-",{"$f":"HLOOKUP(F746,'Coding and Prices'!A506:G508,3,0)","v":"P03"},"-",null,"X35",1,null,{"$f":"((HLOOKUP(D746,'Coding and Prices'!A510:C511,2,0))*1.85)*1.06","v":11.276440272000002},{"$f":"Q745*P745","v":0}]
[null,null,null,"Disinfectant wipes refill",null,"Red"]
[]
[null,"Steri - 99.9 Wipes \n(Alcohol Free)","Detectable Lid","Alcohol free Disinfectant Wipes",null,"200 x 200 x 200mm",430,"-","T210","-","X35","-",null,"A88",1,null,8.4715200000000017,{"$f":"Q748*P748","v":0}]
[null,null,"Detectable Lid","Alcohol free Probe Wipes",null,"130 x 130 x 200mm ",430,"-","T211","-","X35","-",null,"A88",null,null,5.0617332000000008,{"$f":"Q749*P749","v":0}]
[]
[null,"Steri - 99.9 Wipes \n(Alcohol Free)","Non Detectable Lid","Alcohol free Disinfectant Wipes",null,"200 x 200 x 200mm",430,"-","T210","-","X35","-",null,"A87",1,null,7.4972952000000008,{"$f":"Q751*P751","v":0}]
[null,null,"Non Detectable Lid","Alcohol free Probe Wipes",null,"130 x 130 x 200mm ",430,"-","T211","-","X35","-",null,"A87",null,null,4.193402400000001,{"$f":"Q752*P752","v":0}]
[]
[null,"Steri - 99.9 Wipe Holder","Type","Size",null,null,431,"-","A25","-",{"$f":"HLOOKUP(D755,'Coding and Prices'!A519:F521,3,0)","v":"X36"},"-",null,{"$f":"HLOOKUP(C755,'Coding and Prices'!A519:C520,2,0)","v":"P45"},1,null,{"$f":"((INDEX('Coding and Prices'!A523:D525,MATCH('Price List'!C755,'Coding and Prices'!A523:A525,0),MATCH('Price List'!D755,'Coding and Prices'!A523:D523,0)))*1.85)*1.06","v":38.381068512000013},{"$f":"Q754*P754","v":0}]
[null,null,"Stainless Steel","Single disinfectant wipe holder"]
[]
[null,"Steri - 99.9 Wipes Refill Pack","Type",null,null,null,430,"-",{"$f":"HLOOKUP(C758,'Coding and Prices'!A513:C514,2,0)","v":"T213"},"-","X35","-",null,"A89",1,null,{"$f":"((HLOOKUP(C758,'Coding and Prices'!A516:C517,2,0))*1.85)*1.06","v":3.4538387040000007},{"$f":"Q757*P757","v":0}]
[null,null,"Alcohol free probe wipes"]
[]
[null,"Paper Towel Holder","Colour",null,null,null,null,null,436,"-","S572","-",null,{"$f":"HLOOKUP(C761,'Coding and Prices'!A1094:J1095,2,0)","v":"P01"},1,null,21.571000000000002,{"$f":"Q760*P760","v":0}]
[null,null,"Blue"]
[]
[null,"Detectable Shovel","Type","Blue",null,null,null,null,530,"-",{"$f":"HLOOKUP(C764,'Coding and Prices'!A292:C293,2,0)","v":"S246"},null,null,null,1,null,{"$f":"((HLOOKUP(C764,'Coding and Prices'!A295:C296,2,0))*1.85)*1.06","v":71.160768000000019},{"$f":"Q763*P763","v":0}]
[null,null,"Hand Shovel"]
[]
[null,"Large Floor Ultra Hygienic Squeegee \n- Blade Size 600mm (23.6\")","Type","Blue",null,null,null,null,526,"-","P01","-",null,{"$f":"HLOOKUP(C767,'Coding and Prices'!A527:F528,2,0)","v":"A204"},1,null,{"$f":"((HLOOKUP(C767,'Coding and Prices'!A530:F533,2,0))*1.85)*1.06","v":87.088010000000011},{"$f":"Q766*P766","v":0}]
[null,null,"Blade complete with St/St long handle"]
[]
[null,"Handheld Ultra Hygienic Squeegee \n- Blade Size 300mm (11.75\")","Type","Blue",null,null,null,null,526,"-","P01","-",null,{"$f":"HLOOKUP(C770,'Coding and Prices'!A1294:D1295,2,0)","v":"A211"},1,null,{"$f":"((HLOOKUP(C770,'Coding and Prices'!A1297:D1298,2,0))*1.85)*1.06","v":84.087680000000006},{"$f":"Q769*P769","v":0}]
[null,null,"Blade with stainless steel long handle -  1435mm  (56 1/2\")"]
[]
[null,"Dustpan (Detectable)","Colour",null,null,null,null,null,511,"-",{"$f":"HLOOKUP(C773,'Coding and Prices'!A533:C534,2,0)","v":"P01"},null,null,null,1,null,12.664922400000004,{"$f":"Q772*P772","v":0}]
[null,null,"Blue"]
[]
[null,"Brushes & Brooms - Soft Bristles\n(Detectable)","Type",null,null,null,null,null,510,"-",{"$f":"HLOOKUP(C776,'Coding and Prices'!A536:G537,2,0)","v":"T111"},"-",null,"A45",1,null,{"$f":"((HLOOKUP(C776,'Coding and Prices'!A539:G540,2,0))*1.85)*1.06","v":12.603080304000001},{"$f":"Q775*P775","v":0}]
[null,null,"Nail Brush - 115 x 43 x 46mm  \n (4.5 x 1.7 x 1.8\")"]
[]
[null,"Brushes & Brooms - Medium Bristles\n(Detectable)","Type",null,null,null,null,null,510,"-",{"$f":"HLOOKUP(C779,'Coding and Prices'!A542:H543,2,0)","v":"T112"},"-",null,"A46",1,null,{"$f":"((HLOOKUP(C779,'Coding and Prices'!A545:H546,2,0))*1.85)*1.06","v":14.272816896000005},{"$f":"Q778*P778","v":0}]
[null,null,"Dish Brush - 235 x 40 x 50mm\n ( 9.25 x 1.57 x 1.97\")"]
[]
[null,"Brushes & Brooms - Resin Set\n(Detectable)","Type",null,null,null,null,null,512,"-","A49","-",null,{"$f":"HLOOKUP(C782,'Coding and Prices'!A548:F549,2,0)","v":"T118"},1,null,{"$f":"((HLOOKUP(C782,'Coding and Prices'!A551:F552,2,0))*1.85)*1.06","v":98.720316864000011},{"$f":"Q781*P781","v":0}]
[null,null,"Medium flat sweeping broom - 300 x 75mm\n (11.8 x 3\")"]
[]
[null,"Long Handles for Brushes,Brooms & Squeegees","Type",null,null,null,null,null,526,"-","P01","-",null,{"$f":"HLOOKUP(C785,'Coding and Prices'!A1288:C1289,2,0)","v":"A43"},1,null,{"$f":"((HLOOKUP(C785,'Coding and Prices'!A1291:C1292,2,0))*1.85)*1.06","v":67.478009999999998},{"$f":"Q784*P784","v":0}]
[null,null,"Fully detectable long handle only  - 1435mm \n(56 1/2\")"]
[null,"Hygiene & Protective Workwear"]
[null,"Hairnets & Mopcaps\nMesh Hairnets\nNon Woven Mopcaps\nDetectable Hair Ties\nDetectable Bun Nets\nDetectable Balaclava Hoods\nNon -Woven Beard Snoods\nMesh Beard Snoods\n\n\n\n\n","Gloves , Aprons and Shoe Covers\nDisposable Vinyl Gloves\nMechanical Nitrile Gloves\nDetectable Sleeve Covers\nDisposable Polythene Aprons\nDetectable Shoe Covers\n",null,"PPE Dispensers & Storage\nMulti Purpose Stainless Steel Dispenser\nStainless Steel Glove Dispenser\nDetectable Glove Dispenser\nEarplugs Storage Box\n\n\n\n",null,"Other PPE Equipment & Workwear\nEarplugs & Hearing Protection\nDetectable Face Masks\nSafety Glasses\nDetectable Plasters & Dressings\nGlasses String\nGlove Guard\n\n"]
[]
[null,"Hairnets - Close Mesh 5mm\n(Detectable)","Colour",null,null,null,440,"-","T023","-",{"$f":"HLOOKUP(C790,'Coding and Prices'!A710:F711,2,0)","v":"P04"},"-","X11",null,100,null,{"$f":"((HLOOKUP(C790,'Coding and Prices'!A713:F714,2,0))*1.85)*1.06","v":27.454000000000004},{"$f":"Q789*P789","v":0}]
[null,null,"Green"]
[]
[null,"Hairnets - Coarse Mesh 10mm\n(Detectable)","Colour",null,null,null,440,"-","T024","-",{"$f":"HLOOKUP(C793,'Coding and Prices'!A716:D717,2,0)","v":"P01"},"-","X11",null,100,null,{"$f":"((HLOOKUP(C793,'Coding and Prices'!A719:D720,2,0))*1.85)*1.06","v":19.61},{"$f":"Q792*P792","v":0}]
[null,null,"Blue"]
[]
[null,"Hairnets - Extra Close Mesh 3mm\n(Detectable)","Colour",null,null,null,440,"-","T025","-",{"$f":"HLOOKUP(C796,'Coding and Prices'!A722:C723,2,0)","v":"P06"},"-","X11",null,100,null,29.415000000000003,{"$f":"Q795*P795","v":0}]
[null,null,"White"]
[]
[null,"Hairnets \n(Detectable)"]
[null,null,"Fine mesh",null,null,"Blue Only",440,"-","T001","-","P01","-",null,"X11",100,null,17.649000000000004,{"$f":"Q799*P799","v":0}]
[null,null,"Extra fine mesh",null,null,"Blue Only",440,"-","T021","-","P01","-",null,"X11",100,null,21.571000000000002,{"$f":"Q800*P800","v":0}]
[null,null,"Super Fine mesh",null,null,"Blue Only",440,"-","T022","-","P01","-",null,"X06",25,null,14.707500000000001,{"$f":"Q801*P801","v":0}]
[]
[]
[null,"Mob Caps\n(Detectable)","Standard Version (Pack 100)","Colour",null,null,446,"-","T009","-",{"$f":"HLOOKUP(D805,'Coding and Prices'!A725:D726,2,0)","v":"P03"},"-","X32",null,1000,null,62.75200000000001,{"$f":"Q804*P804","v":0}]
[null,null,null,"Red"]
[]
[null,"Mob Caps\n(Detectable)","Premium Version (Pack 100)","Colour",null,null,446,"-","T010","-",{"$f":"HLOOKUP(D808,'Coding and Prices'!A728:F729,2,0)","v":"P01"},"-","X32",null,1000,null,{"$f":"((HLOOKUP(D808,'Coding and Prices'!A731:F732,2,0))*1.85)*1.06","v":84.715200000000024},{"$f":"Q807*P807","v":0}]
[null,null,null,"Blue"]
[]
[null,"Hairband\n(Detectable)","Blue Only",null,null,null,null,null,"442B","-","P01",null,null,null,25,null,24.5,{"$f":"Q810*P810","v":0}]
[]
[]
[null,"Hair Tie\n(Detectable)","Blue Only",null,null,null,null,null,465,"-","P01","-","X06",null,25,null,14.707500000000001,{"$f":"Q813*P813","v":0}]
[]
[]
[null,"Bun Nets\n(Detectable)","Blue Only",null,null,null,null,null,447,"-","P01","-","X09",null,20,null,8.2362000000000002,{"$f":"Q816*P816","v":0}]
[]
[]
[null,"Balaclava Hood\n(Detectable)","Colour",null,null,null,null,null,441,"-","T009","-",{"$f":"HLOOKUP(C820,'Coding and Prices'!A734:D735,2,0)","v":"P01"},null,100,null,17.649000000000004,{"$f":"Q819*P819","v":0}]
[null,null,"Blue"]
[]
[null,"Re-usable Balaclava Hood\n(Detectable)","White",null,null,null,null,null,441,"-","T020","-","P06",null,10,null,20.963090000000001,{"$f":"Q822*P822","v":0}]
[]
[]
[null,"Beard Snoods\n(Detectable)","Non Woven","Colour",null,null,445,"-","T013","-",{"$f":"HLOOKUP(D826,'Coding and Prices'!A737:D738,2,0)","v":"P01"},"-","X33",null,500,null,74.518000000000001,{"$f":"Q825*P825","v":0}]
[null,null,null,"Blue"]
[]
[null,"Beard Snood\n(Detectable)"]
[null,null,"Close mesh","25 per card",null,"Blue Only",445,"-","T012","-","P01","-",null,"X06",25,null,7.8440000000000012,{"$f":"Q829*P829","v":0}]
[null,null,"Extra close mesh","25 per card",null,"Blue Only",445,"-","T011","-","P01","-",null,"X06",25,null,8.3342500000000008,{"$f":"Q830*P830","v":0}]
[null,null,"Fine mesh","25 per card",null,"Blue Only",445,"-","T001","-","P01","-",null,"X06",25,null,13.236750000000001,{"$f":"Q831*P831","v":0}]
[]
[]
[null,"Stainless Steel Multi Purpose Dispenser","Type",null,null,null,null,null,453,"-","P45","-",null,{"$f":"HLOOKUP(C835,'Coding and Prices'!A438:D439,2,0)","v":"A25"},1,null,{"$f":"((HLOOKUP(C835,'Coding and Prices'!A441:D442,2,0))*1.85)*1.06","v":190.30422528000003},{"$f":"Q834*P834","v":0}]
[null,null,"Wall mounted Dispenser Only"]
[null,"Gloves, Aprons & Shoe Covers"]
[]
[null,"Disposable Vinyl Gloves\n(Detectable)","Powder Free","Size",null,"Box of 1000",450,"-","A65","-",{"$f":"HLOOKUP(D839,'Coding and Prices'!A740:E741,2,0)","v":"S091"},"-",null,"X31",1000,null,94.128000000000014,{"$f":"P838*Q838","v":0}]
[null,null,null,"Large"]
[]
[null,"Nitrile Gloves - Part coated\n(Detectable)","Woven, cuffed , upper hand","Size",null,null,455,"-","A101","-","T18","-",null,{"$f":"HLOOKUP(D842,'Coding and Prices'!A743:F744,2,0)","v":"S107"},1,null,5.6869000000000005,{"$f":"P841*Q841","v":0}]
[null,null,null,8]
[]
[null,"Nitrile Gloves - Fully coated\n(Detectable)",null,"Size",null,null,455,"-","A101","-","T017","-",null,{"$f":"HLOOKUP(D845,'Coding and Prices'!A743:F744,2,0)","v":"S108"},1,null,7.5498500000000011,{"$f":"P844*Q844","v":0}]
[null,null,null,9]
[]
[null,"Nitrile Gloves - Reinforced seamless cuff \n(Detectable)","Type","Size",null,"Fully Coated",455,"-",{"$f":"HLOOKUP(C848,'Coding and Prices'!A746:G748,2,0)","v":"A160"},"-","T017","-",null,{"$f":"HLOOKUP(D848,'Coding and Prices'!A746:G748,3,0)","v":"S109"},1,null,{"$f":"((HLOOKUP(C848,'Coding and Prices'!A750:D751,2,0))*1.85)*1.06","v":23.550825600000003},{"$f":"P847*Q847","v":0}]
[null,null,"Up to shoulder length",10]
[]
[null,"Sleeve Covers\n(Detectable)","Colour",null,null,null,null,null,438,"-",{"$f":"HLOOKUP(C851,'Coding and Prices'!A756:D757,2,0)","v":"P06"},"-",null,"X32",1000,null,90.206000000000017,{"$f":"P850*Q850","v":0}]
[null,null,"White"]
[]
[null,"Disposable Aprons - Polythene\n(Detectable)","Colour","1250 x 70cm",null,null,449,"-",{"$f":"HLOOKUP(C854,'Coding and Prices'!A753:C754,2,0)","v":"P01"},"-","S219","-",null,"X16",100,null,25.493000000000002,{"$f":"P853*Q853","v":0}]
[null,null,"Blue"]
[]
[null,"Shoe Cover\n(Detectable)","Colour",null,null,null,null,null,439,"-",{"$f":"HLOOKUP('Price List'!C857,'Coding and Prices'!B756:D757,2,0)","v":"P01"},"-",null,"X32",1000,null,101.97200000000001,{"$f":"P856*Q856","v":0}]
[null,null,"Blue"]
[null,"PPE Dispensers & Storage"]
[]
[null,"Vinyl Glove Dispenser Box \n(Detectable)","To suit small, medium, large \n& extra large","Size",null,"Colour",null,null,451,"-",{"$f":"HLOOKUP(D861,'Coding and Prices'!A759:G760,2,0)","v":"A151"},"-",{"$f":"HLOOKUP(F861,'Coding and Prices'!A759:P761,3,0)","v":"P03"},null,1,null,{"$f":"((HLOOKUP(D861,'Coding and Prices'!A763:G764,2,0))*1.85)*1.06","v":18.955026000000004},{"$f":"Q860*P860","v":0}]
[null,null,null,"1 Box Capacity",null,"Red"]
[null,"Vinyl Glove Dispenser Box \nStainless Steel","To suit small, medium, large \n& extra large","Size"]
[null,null,null,"1 box capacity -  horizontal",null,null,null,null,454,"-","A151","-",null,{"$f":"HLOOKUP(D863,'Coding and Prices'!A766:C767,2,0)","v":"A157"},1,null,{"$f":"((HLOOKUP(D863,'Coding and Prices'!A769:C770,2,0))*1.85)*1.06","v":40.959799199999999},{"$f":"Q863*P863","v":0}]
[null,null,null,"2 box capacity",null,null,null,null,454,"-","A152","-",null,"A146",1,null,76.92140160000001,0]
[null,null,null,"3 box capacity",null,null,null,null,454,"-","A153","-",null,"A157",1,null,83.402114400000016,0]
[null,null,null,"4 box capacity -  vertical",null,null,null,null,454,"-","A154","-",null,{"$f":"HLOOKUP(D866,'Coding and Prices'!A772:C773,2,0)","v":"A158"},1,null,{"$f":"((HLOOKUP(D866,'Coding and Prices'!A775:C776,2,0))*1.85)*1.06","v":130.60965960000001},0]
[null,null,null,"4 box horizontal & probe wipe holder",null,null,null,null,454,"-","A154","-",null,"A18",1,null,162.25078680000004,0]
[null,null,null,"1 Box Enclosed Dispenser",null,null,null,null,454,"-","A151","-",null,"A158",1,null,40.965290000000003,0]
[]
[]
[null,"Automatic Shoe Cover Dispenser","Stainless Steel",null,null,null,null,null,459,"-","P49",null,null,null,1,null,90.200509200000013,{"$f":"Q871*P871","v":0}]
[]
[]
[null,"Earplug Storage Box \n(Detectable)","63 x 42 x 24mm","Colour",null,null,416,"-","A65","-","S159","-",null,{"$f":"HLOOKUP(D875,'Coding and Prices'!A781:F782,2,0)","v":"P01"},25,null,26.963750000000001,{"$f":"Q874*P874","v":0}]
[null,null,null,"Blue"]
[]
[null,"Earplug Dispenser Box ","L - 250 x W -160 x D - 250mm","Can be own branded",null,null,null,null,414,"-","S155","-",null,"P06",10,null,15.491900000000003,{"$f":"Q877*P877","v":0}]
[]
[null,"Other PPE & Equipment"]
[]
[null,"Earplugs \n(Detectable Cord & Plug)","Type","Size",null,null,410,"-",{"$f":"HLOOKUP(C882,'Coding and Prices'!A784:D785,2,0)","v":"P20"},"-",{"$f":"HLOOKUP(D882,'Coding and Prices'!A784:G786,3,0)","v":"S102"},"-",null,"X18",200,null,{"$f":"((HLOOKUP(D882,'Coding and Prices'!A788:C789,2,0))*1.85)*1.06","v":372.59000000000003},{"$f":"Q881*P881","v":0}]
[null,null,"blue cord with 2 blue plugs","3 Flange"]
[]
[null,"Earplugs - Plugs only","Size","Colour",null,null,415,"-",{"$f":"HLOOKUP(C885,'Coding and Prices'!A794:C795,2,0)","v":"S102"},"-",{"$f":"HLOOKUP(D885,'Coding and Prices'!A794:E796,3,0)","v":"P03"},"-",null,"X18",200,null,{"$f":"((HLOOKUP(C885,'Coding and Prices'!A798:C799,2,0))*1.85)*1.06","v":178.45099999999999},{"$f":"Q884*P884","v":0}]
[null,null,"3 Flange","Red"]
[]
[null,"Disposable Earplugs\n(Detectable)"]
[null,null,"Blue foam ","Un-corded",null,null,412,"-","P01","-","A149","-",null,"X29",250,null,78.44,{"$f":"Q888*P888","v":0}]
[null,null,"Blue foam ","Complete with detectable cord",null,null,412,"-","P01","-","A150","-",null,"X29",250,null,121.58200000000001,{"$f":"Q889*P889","v":0}]
[null,null,"Yellow foam ","Complete with detectable cord",null,null,412,"-","P05","-","A150","-",null,"X29",250,null,121.58200000000001,{"$f":"Q890*P890","v":0}]
[]
[]
[null,"Expand-A-Band"]
[null,null,"2 Flange",null,null,null,null,null,413,"-","S101","-",null,"X07",30,null,52.947000000000003,{"$f":"Q894*P894","v":0}]
[null,null,"Replacement Ear Plugs"," 2 Flange (Pair)",null,null,null,null,413,"-","S402","-",null,"X18",200,null,223.55400000000003,{"$f":"Q895*P895","v":0}]
[]
[]
[null,"Face Mask"]
[null,null,"FFFP2","Fold Flat",null,null,null,null,460,"-","T026","-",null,"A65",10,null,73.145299999999992,{"$f":"Q899*P899","v":0}]
[null,null,"FFFP3 - Detectable","Disposable filtering face piece",null,null,null,null,460,"-","TO27","-",null,"A65",5,null,64.124700000000018,{"$f":"Q900*P900","v":0}]
[null,null,"FFFP3 - Non Detectable","Disposable filtering face piece",null,null,null,null,460,"-","T027","-",null,"A66",5,null,59.320250000000009,{"$f":"Q901*P901","v":0}]
[]
[]
[null,"Safety Glasses","Polycarbonate Lens","Polypropylene Frame",null,null,null,null,420,"-","A67",null,null,null,1,null,13.215571200000001,{"$f":"Q904*P904","v":0}]
[]
[]
[null,"Glasses String \n(Metal Detectable)","Silicone Rubber Blue",null,null,null,null,null,466,"-","P75","-",null,"X06",25,null,50,{"$f":"Q907*P907","v":0}]
[]
[]
[null,"Glasses String","Blue",null,null,null,null,null,466,"-","P01","-",null,"X06",25,null,14.707500000000001,{"$f":"Q910*P910","v":0}]
[]
[]
[null,"Plasters\n(Metal Detectable)","Size"]
[null,null,"75 x 25 mm (100 pcs)",null,null,null,400,"-","T151","-",{"$f":"HLOOKUP(C914,'Coding and Prices'!A807:H808,2,0)","v":"S136"},"-",null,"X11",1,null,{"$f":"((HLOOKUP(C914,'Coding and Prices'!A810:H811,2,0))*1.85)*1.06","v":14.6769084},{"$f":"Q914*P914","v":0}]
[null,null,"Assorted Pack","100 pcs",null,null,400,"-","T154","-","S400","-",null,"X11",1,null,17.514867600000002,{"$f":"Q915*P915","v":0}]
[null,null,"Standard","25mm x 5mm",null,null,402,"-","T153","-","P01","-",null,"S222",1,null,4.9346604000000012,{"$f":"Q916*P916","v":0}]
[null,null,"Finger Extension","16 x 2cm (50 pcs)",null,null,400,"-","T152","-","S250","-",null,"X09",1,null,16.858324800000002,{"$f":"Q917*P917","v":0}]
[]
[]
[null,"Plasters\n(X-Ray Visible)","Size"]
[null,null,"72 x 22 mm","100 pcs",null,null,401,"-","T151","-",{"$f":"HLOOKUP(C921,'Coding and Prices'!A813:D814,2,0)","v":"S134"},"-",null,"X11",1,null,{"$f":"((HLOOKUP(C921,'Coding and Prices'!A816:D817,2,0))*1.85)*1.06","v":37.295866800000006},{"$f":"Q921*P921","v":0}]
[null,null,"Assorted Pack","5 sizes (95pcs) ",null,null,401,"-","T154","-","S400","-",null,"X28",1,null,46.551002400000016,{"$f":"Q922*P922","v":0}]
[null,null,"Fingertip","50 x 44mm (50 pcs)",null,null,401,"-","T150","-","S129","-",null,"X09",1,null,30.751617600000007,{"$f":"Q923*P923","v":0}]
[]
[]
[null,"Glove Guard","Type",null,null,null,null,null,452,"-",{"$f":"HLOOKUP(C927,'Coding and Prices'!A801:C802,2,0)","v":"A95"},null,null,null,10,null,{"$f":"((HLOOKUP(C927,'Coding and Prices'!A804:C805,2,0))*1.85)*1.06","v":94.716300000000004},{"$f":"Q926*P926","v":0}]
[null,null,"Grip each end"]
[]
[null,"Detectable Utility Clip\n 'DUC' Clip","Type",null,null,null,null,null,469,"-",{"$f":"HLOOKUP(C930,'Coding and Prices'!A1448:C1449,2,0)","v":"A96"},null,null,null,10,null,77.459500000000006,{"$f":"Q929*P929","v":0}]
[null,null,"With Belt Clip"]
[]
[]
[]
[]
[]
[]
[]
[]
[]
[null,"Test Sticks"]
[null,"Create Your Own - These options are customisable and will create your code and purchase price for you",null,null,null,null,null,null,null,null,null,null,null,null,"Unit Per Pack","Running Total",{"$f":"SUM(R941:R1168)","v":0}]
[]
[null,null,null,null,null,null,"Product Code",null,null,null,null,null,null,null,null,"Quantity","Price","Total"]
[null,"Test Stick Standard Size \n(100mm x 12mm x 10mm)\n\n\nOther Size are available upon Request","Test Stick Contaminant","Contaminant Size","Contaminant Type"]
[null,null,"Ferrous","0.25mm","Standard Blue",null,900,"-",{"$f":"HLOOKUP(D945,'Coding and Prices'!A1422:BF1423,2,0)","v":"E01"},"-","F01","-",null,{"$f":"HLOOKUP(E945,'Coding and Prices'!A1440:F1441,2,0)","v":"G09"},1,null,{"$f":"(HLOOKUP(D945,'Coding and Prices'!A1427:BF1428,2,0))*1.85","v":19.425000000000001},{"$f":"P945*Q945","v":0}]
[null,null,"Non Ferrous","0.3mm","Standard Blue",null,900,"-",{"$f":"HLOOKUP(D946,'Coding and Prices'!A1422:BF1423,2,0)","v":"E02"},"-","F02","-",null,{"$f":"HLOOKUP(E946,'Coding and Prices'!A1440:F1441,2,0)","v":"G09"},1,null,{"$f":"(HLOOKUP(D946,'Coding and Prices'!A1427:BF1428,2,0))*1.85","v":19.425000000000001},{"$f":"P946*Q946","v":0}]
[null,null,"Stainless Steel 316","0.3mm","Standard",null,900,"-",{"$f":"HLOOKUP(D947,'Coding and Prices'!A1422:BF1423,2,0)","v":"E02"},"-","F03","-",null,{"$f":"HLOOKUP(E947,'Coding and Prices'!A1440:F1441,2,0)","v":"G55"},1,null,{"$f":"(HLOOKUP(D947,'Coding and Prices'!A1427:BF1428,2,0))*1.85","v":19.425000000000001},{"$f":"P947*Q947","v":0}]
[null,null,"Stainless Steel 304","0.5mm","Standard Red",null,900,"-",{"$f":"HLOOKUP(D948,'Coding and Prices'!A1422:BF1423,2,0)","v":"E05"},"-","F04","-",null,{"$f":"HLOOKUP(E948,'Coding and Prices'!A1440:F1441,2,0)","v":"G20"},1,null,{"$f":"(HLOOKUP(D948,'Coding and Prices'!A1427:BF1428,2,0))*1.85","v":19.425000000000001},0]
[null,null,"Aluminium","0.8mm","Standard Blue",null,900,"-",{"$f":"HLOOKUP(D949,'Coding and Prices'!A1422:BF1423,2,0)","v":"E08"},"-","F07","-",null,{"$f":"HLOOKUP(E949,'Coding and Prices'!A1440:F1441,2,0)","v":"G09"},1,null,{"$f":"(HLOOKUP(D949,'Coding and Prices'!A1427:BF1428,2,0))*1.85","v":19.425000000000001},0]
[null,null,"Ph Bronze","1.5mm","Standard Blue",null,900,"-",{"$f":"HLOOKUP(D950,'Coding and Prices'!A1422:BF1423,2,0)","v":"E15"},"-","F08","-",null,{"$f":"HLOOKUP(E950,'Coding and Prices'!A1440:F1441,2,0)","v":"G09"},1,null,{"$f":"(HLOOKUP(D950,'Coding and Prices'!A1427:BF1428,2,0))*1.85","v":19.425000000000001},0]
[null,null,"Soda Lime Glass","1.0mm","Standard Blue",null,900,"-",{"$f":"HLOOKUP(D951,'Coding and Prices'!A1422:BF1423,2,0)","v":"E10"},"-","F09","-",null,{"$f":"HLOOKUP(E951,'Coding and Prices'!A1440:F1441,2,0)","v":"G09"},1,null,{"$f":"(HLOOKUP(D951,'Coding and Prices'!A1427:BF1428,2,0))*1.85","v":19.425000000000001},0]
[null,null,"Teflon (PTFE)","1.5mm","Standard Blue",null,900,"-",{"$f":"HLOOKUP(D952,'Coding and Prices'!A1422:BF1423,2,0)","v":"E15"},"-","F10","-",null,{"$f":"HLOOKUP(E952,'Coding and Prices'!A1440:F1441,2,0)","v":"G09"},1,null,{"$f":"(HLOOKUP(D952,'Coding and Prices'!A1427:BF1428,2,0))*1.85","v":19.425000000000001},0]
[null,null,"Crystal Glass","2mm","Standard Blue",null,900,"-",{"$f":"HLOOKUP(D953,'Coding and Prices'!A1422:BF1423,2,0)","v":"E20"},"-","F11","-",null,{"$f":"HLOOKUP(E953,'Coding and Prices'!A1440:F1441,2,0)","v":"G09"},1,null,{"$f":"(HLOOKUP(D953,'Coding and Prices'!A1427:BF1428,2,0))*1.85","v":19.425000000000001},0]
[null,null,"Ceramic","1.0mm","Standard Blue",null,900,"-",{"$f":"HLOOKUP(D954,'Coding and Prices'!A1422:BF1423,2,0)","v":"E10"},"-","F12","-",null,{"$f":"HLOOKUP(E954,'Coding and Prices'!A1440:F1441,2,0)","v":"G09"},1,null,{"$f":"(HLOOKUP(D954,'Coding and Prices'!A1427:BF1428,2,0))*1.85","v":19.425000000000001},0]
[null,null,"Nylon Grade 1","2mm","Standard",null,900,"-",{"$f":"HLOOKUP(D955,'Coding and Prices'!A1422:BF1423,2,0)","v":"E20"},"-","F13","-",null,{"$f":"HLOOKUP(E955,'Coding and Prices'!A1440:F1441,2,0)","v":"G55"},1,null,{"$f":"(HLOOKUP(D955,'Coding and Prices'!A1427:BF1428,2,0))*1.85","v":19.425000000000001},0]
[null,null,"Zirconia","1.0mm","Standard Blue",null,900,"-",{"$f":"HLOOKUP(D956,'Coding and Prices'!A1422:BF1423,2,0)","v":"E10"},"-","F15","-",null,{"$f":"HLOOKUP(E956,'Coding and Prices'!A1440:F1441,2,0)","v":"G09"},1,null,{"$f":"(HLOOKUP(D956,'Coding and Prices'!A1427:BF1428,2,0))*1.85","v":19.425000000000001},0]
[null,null,"Stainless Steel 316 Wire","3.0mm","Standard Red",null,900,"-",{"$f":"HLOOKUP(D957,'Coding and Prices'!A1422:BF1423,2,0)","v":"E28"},"-","F16","-",null,{"$f":"HLOOKUP(E957,'Coding and Prices'!A1440:F1441,2,0)","v":"G20"},1,null,{"$f":"(HLOOKUP(D957,'Coding and Prices'!A1427:BF1428,2,0))*1.85","v":19.425000000000001},0]
[null,null,"Copper Wire","3.0mm","Standard Blue",null,900,null,{"$f":"HLOOKUP(D958,'Coding and Prices'!A1422:BF1423,2,0)","v":"E28"},"-","F23","-",null,{"$f":"HLOOKUP(E958,'Coding and Prices'!A1440:F1441,2,0)","v":"G09"},1,null,{"$f":"(HLOOKUP(D958,'Coding and Prices'!A1427:BF1428,2,0))*1.85","v":19.425000000000001},0]
[]
[]
[null,"Flexi Test Stick - Standard\n(100mm x 12mm x 10mm)\n\n\nOther Size are available upon Request","Test Stick Contaminant","Contaminant Size","Contaminant Type"]
[null,null,"Ferrous","0.25mm","Standard Blue",null,915,"-",{"$f":"HLOOKUP(D962,'Coding and Prices'!A1422:BF1423,2,0)","v":"E01"},"-","F01","-",null,{"$f":"HLOOKUP(E962,'Coding and Prices'!A1440:F1441,2,0)","v":"G09"},1,null,{"$f":"(HLOOKUP(D962,'Coding and Prices'!A1427:BF1428,2,0))*1.85","v":19.425000000000001},{"$f":"P962*Q962","v":0}]
[null,null,"Non Ferrous","0.3mm","Standard Blue",null,915,"-",{"$f":"HLOOKUP(D963,'Coding and Prices'!A1422:BF1423,2,0)","v":"E02"},"-","F02","-",null,{"$f":"HLOOKUP(E963,'Coding and Prices'!A1440:F1441,2,0)","v":"G09"},1,null,{"$f":"(HLOOKUP(D963,'Coding and Prices'!A1427:BF1428,2,0))*1.85","v":19.425000000000001},{"$f":"P963*Q963","v":0}]
[null,null,"Stainless Steel 316","0.3mm","Standard",null,915,"-",{"$f":"HLOOKUP(D964,'Coding and Prices'!A1422:BF1423,2,0)","v":"E02"},"-","F03","-",null,{"$f":"HLOOKUP(E964,'Coding and Prices'!A1440:F1441,2,0)","v":"G55"},1,null,{"$f":"(HLOOKUP(D964,'Coding and Prices'!A1427:BF1428,2,0))*1.85","v":19.425000000000001},{"$f":"P964*Q964","v":0}]
[null,null,"Stainless Steel 304","0.5mm","Standard Red",null,915,"-",{"$f":"HLOOKUP(D965,'Coding and Prices'!A1422:BF1423,2,0)","v":"E05"},"-","F04","-",null,{"$f":"HLOOKUP(E965,'Coding and Prices'!A1440:F1441,2,0)","v":"G20"},1,null,{"$f":"(HLOOKUP(D965,'Coding and Prices'!A1427:BF1428,2,0))*1.85","v":19.425000000000001},0]
[null,null,"Aluminium","0.8mm","Standard Blue",null,915,"-",{"$f":"HLOOKUP(D966,'Coding and Prices'!A1422:BF1423,2,0)","v":"E08"},"-","F07","-",null,{"$f":"HLOOKUP(E966,'Coding and Prices'!A1440:F1441,2,0)","v":"G09"},1,null,{"$f":"(HLOOKUP(D966,'Coding and Prices'!A1427:BF1428,2,0))*1.85","v":19.425000000000001},0]
[null,null,"Ph Bronze","1.5mm","Standard Blue",null,915,"-",{"$f":"HLOOKUP(D967,'Coding and Prices'!A1422:BF1423,2,0)","v":"E15"},"-","F08","-",null,{"$f":"HLOOKUP(E967,'Coding and Prices'!A1440:F1441,2,0)","v":"G09"},1,null,{"$f":"(HLOOKUP(D967,'Coding and Prices'!A1427:BF1428,2,0))*1.85","v":19.425000000000001},0]
[null,null,"Soda Lime Glass","1.0mm","Standard Blue",null,915,"-",{"$f":"HLOOKUP(D968,'Coding and Prices'!A1422:BF1423,2,0)","v":"E10"},"-","F09","-",null,{"$f":"HLOOKUP(E968,'Coding and Prices'!A1440:F1441,2,0)","v":"G09"},1,null,{"$f":"(HLOOKUP(D968,'Coding and Prices'!A1427:BF1428,2,0))*1.85","v":19.425000000000001},0]
[null,null,"Teflon (PTFE)","1.5mm","Standard Blue",null,915,"-",{"$f":"HLOOKUP(D969,'Coding and Prices'!A1422:BF1423,2,0)","v":"E15"},"-","F10","-",null,{"$f":"HLOOKUP(E969,'Coding and Prices'!A1440:F1441,2,0)","v":"G09"},1,null,{"$f":"(HLOOKUP(D969,'Coding and Prices'!A1427:BF1428,2,0))*1.85","v":19.425000000000001},0]
[null,null,"Crystal Glass","2mm","Standard Blue",null,915,"-",{"$f":"HLOOKUP(D970,'Coding and Prices'!A1422:BF1423,2,0)","v":"E20"},"-","F11","-",null,{"$f":"HLOOKUP(E970,'Coding and Prices'!A1440:F1441,2,0)","v":"G09"},1,null,{"$f":"(HLOOKUP(D970,'Coding and Prices'!A1427:BF1428,2,0))*1.85","v":19.425000000000001},0]
[null,null,"Ceramic","1.0mm","Standard Blue",null,915,"-",{"$f":"HLOOKUP(D971,'Coding and Prices'!A1422:BF1423,2,0)","v":"E10"},"-","F12","-",null,{"$f":"HLOOKUP(E971,'Coding and Prices'!A1440:F1441,2,0)","v":"G09"},1,null,{"$f":"(HLOOKUP(D971,'Coding and Prices'!A1427:BF1428,2,0))*1.85","v":19.425000000000001},0]
[null,null,"Nylon Grade 1","2mm","Standard",null,915,"-",{"$f":"HLOOKUP(D972,'Coding and Prices'!A1422:BF1423,2,0)","v":"E20"},"-","F13","-",null,{"$f":"HLOOKUP(E972,'Coding and Prices'!A1440:F1441,2,0)","v":"G55"},1,null,{"$f":"(HLOOKUP(D972,'Coding and Prices'!A1427:BF1428,2,0))*1.85","v":19.425000000000001},0]
[null,null,"Zirconia","1.0mm","Standard Blue",null,915,"-",{"$f":"HLOOKUP(D973,'Coding and Prices'!A1422:BF1423,2,0)","v":"E10"},"-","F15","-",null,{"$f":"HLOOKUP(E973,'Coding and Prices'!A1440:F1441,2,0)","v":"G09"},1,null,{"$f":"(HLOOKUP(D973,'Coding and Prices'!A1427:BF1428,2,0))*1.85","v":19.425000000000001},0]
[null,null,"Stainless Steel 316 Wire","3.0mm","Standard Red",null,915,"-",{"$f":"HLOOKUP(D974,'Coding and Prices'!A1422:BF1423,2,0)","v":"E28"},"-","F16","-",null,{"$f":"HLOOKUP(E974,'Coding and Prices'!A1440:F1441,2,0)","v":"G20"},1,null,{"$f":"(HLOOKUP(D974,'Coding and Prices'!A1427:BF1428,2,0))*1.85","v":19.425000000000001},0]
[null,null,"Copper Wire","3.0mm","Standard Blue",null,915,null,{"$f":"HLOOKUP(D975,'Coding and Prices'!A1422:BF1423,2,0)","v":"E28"},"-","F23","-",null,{"$f":"HLOOKUP(E975,'Coding and Prices'!A1440:F1441,2,0)","v":"G09"},1,null,{"$f":"(HLOOKUP(D975,'Coding and Prices'!A1427:BF1428,2,0))*1.85","v":19.425000000000001},0]
[]
[]
[null,"PTFE Test Stick\n(200mm x 10mm x 5mm)\n\n\nOther Size are available upon Request","Test Stick Contaminant","Contaminant Size","Contaminant Type"]
[null,null,"Ferrous","0.25mm","Standard Blue",null,957,"-",{"$f":"HLOOKUP(D979,'Coding and Prices'!A1422:BF1423,2,0)","v":"E01"},"-","F01","-",null,{"$f":"HLOOKUP(E979,'Coding and Prices'!A1440:F1441,2,0)","v":"G09"},1,null,{"$f":"((HLOOKUP(D979,'Coding and Prices'!A1427:BF1428,2,0))*1.85)+1","v":20.425000000000001},{"$f":"P979*Q979","v":0}]
[null,null,"Non Ferrous","0.3mm","Standard Blue",null,957,"-",{"$f":"HLOOKUP(D980,'Coding and Prices'!A1422:BF1423,2,0)","v":"E02"},"-","F02","-",null,{"$f":"HLOOKUP(E980,'Coding and Prices'!A1440:F1441,2,0)","v":"G09"},1,null,{"$f":"((HLOOKUP(D980,'Coding and Prices'!A1427:BF1428,2,0))*1.85)+1","v":20.425000000000001},{"$f":"P980*Q980","v":0}]
[null,null,"Stainless Steel 316","0.3mm","Standard",null,957,"-",{"$f":"HLOOKUP(D981,'Coding and Prices'!A1422:BF1423,2,0)","v":"E02"},"-","F03","-",null,{"$f":"HLOOKUP(E981,'Coding and Prices'!A1440:F1441,2,0)","v":"G55"},1,null,{"$f":"((HLOOKUP(D981,'Coding and Prices'!A1427:BF1428,2,0))*1.85)+1","v":20.425000000000001},{"$f":"P981*Q981","v":0}]
[null,null,"Stainless Steel 304","0.5mm","Standard Red",null,957,"-",{"$f":"HLOOKUP(D982,'Coding and Prices'!A1422:BF1423,2,0)","v":"E05"},"-","F04","-",null,{"$f":"HLOOKUP(E982,'Coding and Prices'!A1440:F1441,2,0)","v":"G20"},1,null,{"$f":"((HLOOKUP(D982,'Coding and Prices'!A1427:BF1428,2,0))*1.85)+1","v":20.425000000000001},0]
[null,null,"Aluminium","0.8mm","Standard Blue",null,957,"-",{"$f":"HLOOKUP(D983,'Coding and Prices'!A1422:BF1423,2,0)","v":"E08"},"-","F07","-",null,{"$f":"HLOOKUP(E983,'Coding and Prices'!A1440:F1441,2,0)","v":"G09"},1,null,{"$f":"((HLOOKUP(D983,'Coding and Prices'!A1427:BF1428,2,0))*1.85)+1","v":20.425000000000001},0]
[null,null,"Ph Bronze","1.5mm","Standard Blue",null,957,"-",{"$f":"HLOOKUP(D984,'Coding and Prices'!A1422:BF1423,2,0)","v":"E15"},"-","F08","-",null,{"$f":"HLOOKUP(E984,'Coding and Prices'!A1440:F1441,2,0)","v":"G09"},1,null,{"$f":"((HLOOKUP(D984,'Coding and Prices'!A1427:BF1428,2,0))*1.85)+1","v":20.425000000000001},0]
[null,null,"Soda Lime Glass","1.0mm","Standard Blue",null,957,"-",{"$f":"HLOOKUP(D985,'Coding and Prices'!A1422:BF1423,2,0)","v":"E10"},"-","F09","-",null,{"$f":"HLOOKUP(E985,'Coding and Prices'!A1440:F1441,2,0)","v":"G09"},1,null,{"$f":"((HLOOKUP(D985,'Coding and Prices'!A1427:BF1428,2,0))*1.85)+1","v":20.425000000000001},0]
[null,null,"Teflon (PTFE)","1.5mm","Standard Blue",null,957,"-",{"$f":"HLOOKUP(D986,'Coding and Prices'!A1422:BF1423,2,0)","v":"E15"},"-","F10","-",null,{"$f":"HLOOKUP(E986,'Coding and Prices'!A1440:F1441,2,0)","v":"G09"},1,null,{"$f":"((HLOOKUP(D986,'Coding and Prices'!A1427:BF1428,2,0))*1.85)+1","v":20.425000000000001},0]
[null,null,"Crystal Glass","2mm","Standard Blue",null,957,"-",{"$f":"HLOOKUP(D987,'Coding and Prices'!A1422:BF1423,2,0)","v":"E20"},"-","F11","-",null,{"$f":"HLOOKUP(E987,'Coding and Prices'!A1440:F1441,2,0)","v":"G09"},1,null,{"$f":"((HLOOKUP(D987,'Coding and Prices'!A1427:BF1428,2,0))*1.85)+1","v":20.425000000000001},0]
[null,null,"Ceramic","1.0mm","Standard Blue",null,957,"-",{"$f":"HLOOKUP(D988,'Coding and Prices'!A1422:BF1423,2,0)","v":"E10"},"-","F12","-",null,{"$f":"HLOOKUP(E988,'Coding and Prices'!A1440:F1441,2,0)","v":"G09"},1,null,{"$f":"((HLOOKUP(D988,'Coding and Prices'!A1427:BF1428,2,0))*1.85)+1","v":20.425000000000001},0]
[null,null,"Nylon Grade 1","2mm","Standard",null,957,"-",{"$f":"HLOOKUP(D989,'Coding and Prices'!A1422:BF1423,2,0)","v":"E20"},"-","F13","-",null,{"$f":"HLOOKUP(E989,'Coding and Prices'!A1440:F1441,2,0)","v":"G55"},1,null,{"$f":"((HLOOKUP(D989,'Coding and Prices'!A1427:BF1428,2,0))*1.85)+1","v":20.425000000000001},0]
[null,null,"Zirconia","1.0mm","Standard Blue",null,957,"-",{"$f":"HLOOKUP(D990,'Coding and Prices'!A1422:BF1423,2,0)","v":"E10"},"-","F15","-",null,{"$f":"HLOOKUP(E990,'Coding and Prices'!A1440:F1441,2,0)","v":"G09"},1,null,{"$f":"((HLOOKUP(D990,'Coding and Prices'!A1427:BF1428,2,0))*1.85)+1","v":20.425000000000001},0]
[null,null,"Stainless Steel 316 Wire","3.0mm","Standard Red",null,957,"-",{"$f":"HLOOKUP(D991,'Coding and Prices'!A1422:BF1423,2,0)","v":"E28"},"-","F16","-",null,{"$f":"HLOOKUP(E991,'Coding and Prices'!A1440:F1441,2,0)","v":"G20"},1,null,{"$f":"((HLOOKUP(D991,'Coding and Prices'!A1427:BF1428,2,0))*1.85)+1","v":20.425000000000001},0]
[null,null,"Copper Wire","3.0mm","Standard Blue",null,957,null,{"$f":"HLOOKUP(D992,'Coding and Prices'!A1422:BF1423,2,0)","v":"E28"},"-","F23","-",null,{"$f":"HLOOKUP(E992,'Coding and Prices'!A1440:F1441,2,0)","v":"G09"},1,null,{"$f":"((HLOOKUP(D992,'Coding and Prices'!A1427:BF1428,2,0))*1.85)+1","v":20.425000000000001},0]
[]
[null,"Test Cards"]
[]
[null,"Laminated Test Card\n\nOther Size are available upon Request","Test Stick Contaminant","Contaminant Size","Contaminant Type"]
[null,null,"Ferrous","0.25mm","Standard Blue",null,906,"-",{"$f":"HLOOKUP(D997,'Coding and Prices'!A1331:BF1332,2,0)","v":"E01"},"-","F01","-",null,{"$f":"HLOOKUP(E997,'Coding and Prices'!A1440:F1441,2,0)","v":"G09"},1,null,{"$f":"(HLOOKUP(D997,'Coding and Prices'!A1334:BF1335,2,0))*1.85","v":19.425000000000001},{"$f":"P997*Q997","v":0}]
[null,null,"Non Ferrous","0.3mm","Standard Blue",null,906,"-",{"$f":"HLOOKUP(D998,'Coding and Prices'!A1337:BF1338,2,0)","v":"E02"},"-","F02","-",null,{"$f":"HLOOKUP(E998,'Coding and Prices'!A1440:F1441,2,0)","v":"G09"},1,null,{"$f":"(HLOOKUP(D998,'Coding and Prices'!A1340:BF1341,2,0))*1.85","v":19.425000000000001},{"$f":"P998*Q998","v":0}]
[null,null,"Stainless Steel 316","0.3mm","Standard",null,906,"-",{"$f":"HLOOKUP(D999,'Coding and Prices'!A1343:AT1344,2,0)","v":"E02"},"-","F03","-",null,{"$f":"HLOOKUP(E999,'Coding and Prices'!A1440:F1441,2,0)","v":"G55"},1,null,{"$f":"(HLOOKUP(D999,'Coding and Prices'!A1427:BF1428,2,0))*1.85","v":19.425000000000001},{"$f":"P999*Q999","v":0}]
[null,null,"Stainless Steel 304","0.5mm","Standard Red",null,906,"-",{"$f":"HLOOKUP(D1000,'Coding and Prices'!A1349:AA1350,2,0)","v":"E05"},"-","F04","-",null,{"$f":"HLOOKUP(E1000,'Coding and Prices'!A1440:F1441,2,0)","v":"G20"},1,null,{"$f":"(HLOOKUP(D1000,'Coding and Prices'!A1427:BF1428,2,0))*1.85","v":19.425000000000001},0]
[null,null,"Aluminium","0.8mm","Standard Blue",null,906,"-",{"$f":"HLOOKUP(D1001,'Coding and Prices'!A1355:Q1356,2,0)","v":"E08"},"-","F07","-",null,{"$f":"HLOOKUP(E1001,'Coding and Prices'!A1440:F1441,2,0)","v":"G09"},1,null,{"$f":"(HLOOKUP(D1001,'Coding and Prices'!A1427:BF1428,2,0))*1.85","v":19.425000000000001},0]
[null,null,"Ph Bronze","1.5mm","Standard Blue",null,906,"-",{"$f":"HLOOKUP(D1002,'Coding and Prices'!A1361:G1362,2,0)","v":"E15"},"-","F08","-",null,{"$f":"HLOOKUP(E1002,'Coding and Prices'!A1440:F1441,2,0)","v":"G09"},1,null,{"$f":"(HLOOKUP(D1002,'Coding and Prices'!A1427:BF1428,2,0))*1.85","v":19.425000000000001},0]
[null,null,"Soda Lime Glass","1.0mm","Standard Blue",null,906,"-",{"$f":"HLOOKUP(D1003,'Coding and Prices'!A1367:M1368,2,0)","v":"E10"},"-","F09","-",null,{"$f":"HLOOKUP(E1003,'Coding and Prices'!A1440:F1441,2,0)","v":"G09"},1,null,{"$f":"(HLOOKUP(D1003,'Coding and Prices'!A1427:BF1428,2,0))*1.85","v":19.425000000000001},0]
[null,null,"Teflon (PTFE)","1.5mm","Standard Blue",null,906,"-",{"$f":"HLOOKUP(D1004,'Coding and Prices'!A1373:J1374,2,0)","v":"E15"},"-","F10","-",null,{"$f":"HLOOKUP(E1004,'Coding and Prices'!A1440:F1441,2,0)","v":"G09"},1,null,{"$f":"(HLOOKUP(D1004,'Coding and Prices'!A1427:BF1428,2,0))*1.85","v":19.425000000000001},0]
[null,null,"Crystal Glass","2mm","Standard Blue",null,906,"-",{"$f":"HLOOKUP(D1005,'Coding and Prices'!A1379:G1380,2,0)","v":"E20"},"-","F11","-",null,{"$f":"HLOOKUP(E1005,'Coding and Prices'!A1440:F1441,2,0)","v":"G09"},1,null,{"$f":"(HLOOKUP(D1005,'Coding and Prices'!A1427:BF1428,2,0))*1.85","v":19.425000000000001},0]
[null,null,"Ceramic","1.0mm","Standard Blue",null,906,"-",{"$f":"HLOOKUP(D1006,'Coding and Prices'!A1386:Q1387,2,0)","v":"E10"},"-","F12","-",null,{"$f":"HLOOKUP(E1006,'Coding and Prices'!A1440:F1441,2,0)","v":"G09"},1,null,{"$f":"(HLOOKUP(D1006,'Coding and Prices'!A1427:BF1428,2,0))*1.85","v":19.425000000000001},0]
[null,null,"Nylon Grade 1","2mm","Standard",null,906,"-",{"$f":"HLOOKUP(D1007,'Coding and Prices'!A1392:F1393,2,0)","v":"E20"},"-","F13","-",null,{"$f":"HLOOKUP(E1007,'Coding and Prices'!A1440:F1441,2,0)","v":"G55"},1,null,{"$f":"(HLOOKUP(D1007,'Coding and Prices'!A1427:BF1428,2,0))*1.85","v":19.425000000000001},0]
[null,null,"Zirconia","1.0mm","Standard Blue",null,906,"-",{"$f":"HLOOKUP(D1008,'Coding and Prices'!A1398:I1399,2,0)","v":"E10"},"-","F15","-",null,{"$f":"HLOOKUP(E1008,'Coding and Prices'!A1440:F1441,2,0)","v":"G09"},1,null,{"$f":"(HLOOKUP(D1008,'Coding and Prices'!A1427:BF1428,2,0))*1.85","v":19.425000000000001},0]
[null,null,"Stainless Steel 316 Wire","3.0mm","Standard Red",null,906,"-",{"$f":"HLOOKUP(D1009,'Coding and Prices'!A1410:G1411,2,0)","v":"E28"},"-","F16","-",null,{"$f":"HLOOKUP(E1009,'Coding and Prices'!A1440:F1441,2,0)","v":"G20"},1,null,{"$f":"(HLOOKUP(D1009,'Coding and Prices'!A1427:BF1428,2,0))*1.85","v":19.425000000000001},0]
[null,null,"Copper Wire","3.0mm","Standard Blue",null,906,null,{"$f":"HLOOKUP(D1010,'Coding and Prices'!A1404:J1405,2,0)","v":"E28"},"-","F23","-",null,{"$f":"HLOOKUP(E1010,'Coding and Prices'!A1440:F1441,2,0)","v":"G09"},1,null,{"$f":"(HLOOKUP(D1010,'Coding and Prices'!A1427:BF1428,2,0))*1.85","v":19.425000000000001},0]
[]
[]
[null,"X-Ray Test Card\n\nOther Size are available upon Request","Test Stick Contaminant","Contaminant Size","Contaminant Type"]
[null,null,"Ferrous","0.25mm","Standard Blue",null,920,"-",{"$f":"HLOOKUP(D1014,'Coding and Prices'!A1331:BF1332,2,0)","v":"E01"},"-","F01","-",null,{"$f":"HLOOKUP(E1014,'Coding and Prices'!A1440:F1441,2,0)","v":"G09"},1,null,{"$f":"(HLOOKUP(D1014,'Coding and Prices'!A1334:BF1335,2,0))*1.85","v":19.425000000000001},{"$f":"P1014*Q1014","v":0}]
[null,null,"Non Ferrous","0.3mm","Standard Blue",null,920,"-",{"$f":"HLOOKUP(D1015,'Coding and Prices'!A1331:BF1332,2,0)","v":"E02"},"-","F02","-",null,{"$f":"HLOOKUP(E1015,'Coding and Prices'!A1440:F1441,2,0)","v":"G09"},1,null,{"$f":"(HLOOKUP(D1015,'Coding and Prices'!A1334:BF1335,2,0))*1.85","v":19.425000000000001},{"$f":"P1015*Q1015","v":0}]
[null,null,"Stainless Steel 316","0.3mm","Standard",null,920,"-",{"$f":"HLOOKUP(D1016,'Coding and Prices'!A1331:BF1332,2,0)","v":"E02"},"-","F03","-",null,{"$f":"HLOOKUP(E1016,'Coding and Prices'!A1440:F1441,2,0)","v":"G55"},1,null,{"$f":"(HLOOKUP(D1016,'Coding and Prices'!A1334:BF1335,2,0))*1.85","v":19.425000000000001},{"$f":"P1016*Q1016","v":0}]
[null,null,"Stainless Steel 304","0.5mm","Standard Red",null,920,"-",{"$f":"HLOOKUP(D1017,'Coding and Prices'!A1331:BF1332,2,0)","v":"E05"},"-","F04","-",null,{"$f":"HLOOKUP(E1017,'Coding and Prices'!A1440:F1441,2,0)","v":"G20"},1,null,{"$f":"(HLOOKUP(D1017,'Coding and Prices'!A1334:BF1335,2,0))*1.85","v":19.425000000000001},0]
[null,null,"Aluminium","0.8mm","Standard Blue",null,920,"-",{"$f":"HLOOKUP(D1018,'Coding and Prices'!A1331:BF1332,2,0)","v":"E08"},"-","F07","-",null,{"$f":"HLOOKUP(E1018,'Coding and Prices'!A1440:F1441,2,0)","v":"G09"},1,null,{"$f":"(HLOOKUP(D1018,'Coding and Prices'!A1334:BF1335,2,0))*1.85","v":19.425000000000001},0]
[null,null,"Ph Bronze","1.5mm","Standard Blue",null,920,"-",{"$f":"HLOOKUP(D1019,'Coding and Prices'!A1331:BF1332,2,0)","v":"E15"},"-","F08","-",null,{"$f":"HLOOKUP(E1019,'Coding and Prices'!A1440:F1441,2,0)","v":"G09"},1,null,{"$f":"(HLOOKUP(D1019,'Coding and Prices'!A1334:BF1335,2,0))*1.85","v":19.425000000000001},0]
[null,null,"Soda Lime Glass","1.0mm","Standard Blue",null,920,"-",{"$f":"HLOOKUP(D1020,'Coding and Prices'!A1331:BF1332,2,0)","v":"E10"},"-","F09","-",null,{"$f":"HLOOKUP(E1020,'Coding and Prices'!A1440:F1441,2,0)","v":"G09"},1,null,{"$f":"(HLOOKUP(D1020,'Coding and Prices'!A1334:BF1335,2,0))*1.85","v":19.425000000000001},0]
[null,null,"Teflon (PTFE)","1.5mm","Standard Blue",null,920,"-",{"$f":"HLOOKUP(D1021,'Coding and Prices'!A1331:BF1332,2,0)","v":"E15"},"-","F10","-",null,{"$f":"HLOOKUP(E1021,'Coding and Prices'!A1440:F1441,2,0)","v":"G09"},1,null,{"$f":"(HLOOKUP(D1021,'Coding and Prices'!A1334:BF1335,2,0))*1.85","v":19.425000000000001},0]
[null,null,"Crystal Glass","2mm","Standard Blue",null,920,"-",{"$f":"HLOOKUP(D1022,'Coding and Prices'!A1331:BF1332,2,0)","v":"E20"},"-","F11","-",null,{"$f":"HLOOKUP(E1022,'Coding and Prices'!A1440:F1441,2,0)","v":"G09"},1,null,{"$f":"(HLOOKUP(D1022,'Coding and Prices'!A1334:BF1335,2,0))*1.85","v":19.425000000000001},0]
[null,null,"Ceramic","1.0mm","Standard Blue",null,920,"-",{"$f":"HLOOKUP(D1023,'Coding and Prices'!A1331:BF1332,2,0)","v":"E10"},"-","F12","-",null,{"$f":"HLOOKUP(E1023,'Coding and Prices'!A1440:F1441,2,0)","v":"G09"},1,null,{"$f":"(HLOOKUP(D1023,'Coding and Prices'!A1334:BF1335,2,0))*1.85","v":19.425000000000001},0]
[null,null,"Nylon Grade 1","2mm","Standard",null,920,"-",{"$f":"HLOOKUP(D1024,'Coding and Prices'!A1331:BF1332,2,0)","v":"E20"},"-","F13","-",null,{"$f":"HLOOKUP(E1024,'Coding and Prices'!A1440:F1441,2,0)","v":"G55"},1,null,{"$f":"(HLOOKUP(D1024,'Coding and Prices'!A1334:BF1335,2,0))*1.85","v":19.425000000000001},0]
[null,null,"Zirconia","1.0mm","Standard Blue",null,920,"-",{"$f":"HLOOKUP(D1025,'Coding and Prices'!A1331:BF1332,2,0)","v":"E10"},"-","F15","-",null,{"$f":"HLOOKUP(E1025,'Coding and Prices'!A1440:F1441,2,0)","v":"G09"},1,null,{"$f":"(HLOOKUP(D1025,'Coding and Prices'!A1334:BF1335,2,0))*1.85","v":19.425000000000001},0]
[null,null,"Stainless Steel 316 Wire","3.0mm","Standard Red",null,920,"-",{"$f":"HLOOKUP(D1026,'Coding and Prices'!A1331:BF1332,2,0)","v":"E28"},"-","F16","-",null,{"$f":"HLOOKUP(E1026,'Coding and Prices'!A1440:F1441,2,0)","v":"G20"},1,null,{"$f":"(HLOOKUP(D1026,'Coding and Prices'!A1334:BF1335,2,0))*1.85","v":19.425000000000001},0]
[null,null,"Copper Wire","3.0mm","Standard Blue",null,920,null,{"$f":"HLOOKUP(D1027,'Coding and Prices'!A1331:BF1332,2,0)","v":"E28"},"-","F23","-",null,{"$f":"HLOOKUP(E1027,'Coding and Prices'!A1440:F1441,2,0)","v":"G09"},1,null,{"$f":"(HLOOKUP(D1027,'Coding and Prices'!A1334:BF1335,2,0))*1.85","v":19.425000000000001},0]
[]
[null,"Test Pucks"]
[]
[null,"Test Puck\n\nOther Size are available upon Request","Test Stick Contaminant","Contaminant Size","Contaminant Type"]
[null,null,"Ferrous","0.25mm","Standard Blue",null,920,"-",{"$f":"HLOOKUP(D1032,'Coding and Prices'!A1331:BF1332,2,0)","v":"E01"},"-","F01","-",null,{"$f":"HLOOKUP(E1032,'Coding and Prices'!A1440:F1441,2,0)","v":"G09"},1,null,{"$f":"(HLOOKUP(D1032,'Coding and Prices'!A1427:BF1428,2,0))*1.85","v":19.425000000000001},{"$f":"P1032*Q1032","v":0}]
[null,null,"Non Ferrous","0.3mm","Standard Blue",null,920,"-",{"$f":"HLOOKUP(D1033,'Coding and Prices'!A1331:BF1332,2,0)","v":"E02"},"-","F02","-",null,{"$f":"HLOOKUP(E1033,'Coding and Prices'!A1440:F1441,2,0)","v":"G09"},1,null,{"$f":"(HLOOKUP(D1033,'Coding and Prices'!A1427:BF1428,2,0))*1.85","v":19.425000000000001},{"$f":"P1033*Q1033","v":0}]
[null,null,"Stainless Steel 316","0.3mm","Standard",null,920,"-",{"$f":"HLOOKUP(D1034,'Coding and Prices'!A1331:BF1332,2,0)","v":"E02"},"-","F03","-",null,{"$f":"HLOOKUP(E1034,'Coding and Prices'!A1440:F1441,2,0)","v":"G55"},1,null,{"$f":"(HLOOKUP(D1034,'Coding and Prices'!A1427:BF1428,2,0))*1.85","v":19.425000000000001},{"$f":"P1034*Q1034","v":0}]
[null,null,"Stainless Steel 304","0.5mm","Standard Red",null,920,"-",{"$f":"HLOOKUP(D1035,'Coding and Prices'!A1331:BF1332,2,0)","v":"E05"},"-","F04","-",null,{"$f":"HLOOKUP(E1035,'Coding and Prices'!A1440:F1441,2,0)","v":"G20"},1,null,{"$f":"(HLOOKUP(D1035,'Coding and Prices'!A1427:BF1428,2,0))*1.85","v":19.425000000000001},0]
[null,null,"Aluminium","0.8mm","Standard Blue",null,920,"-",{"$f":"HLOOKUP(D1036,'Coding and Prices'!A1331:BF1332,2,0)","v":"E08"},"-","F07","-",null,{"$f":"HLOOKUP(E1036,'Coding and Prices'!A1440:F1441,2,0)","v":"G09"},1,null,{"$f":"(HLOOKUP(D1036,'Coding and Prices'!A1427:BF1428,2,0))*1.85","v":19.425000000000001},0]
[null,null,"Ph Bronze","1.5mm","Standard Blue",null,920,"-",{"$f":"HLOOKUP(D1037,'Coding and Prices'!A1331:BF1332,2,0)","v":"E15"},"-","F08","-",null,{"$f":"HLOOKUP(E1037,'Coding and Prices'!A1440:F1441,2,0)","v":"G09"},1,null,{"$f":"(HLOOKUP(D1037,'Coding and Prices'!A1427:BF1428,2,0))*1.85","v":19.425000000000001},0]
[null,null,"Soda Lime Glass","1.0mm","Standard Blue",null,920,"-",{"$f":"HLOOKUP(D1038,'Coding and Prices'!A1331:BF1332,2,0)","v":"E10"},"-","F09","-",null,{"$f":"HLOOKUP(E1038,'Coding and Prices'!A1440:F1441,2,0)","v":"G09"},1,null,{"$f":"(HLOOKUP(D1038,'Coding and Prices'!A1427:BF1428,2,0))*1.85","v":19.425000000000001},0]
[null,null,"Teflon (PTFE)","1.5mm","Standard Blue",null,920,"-",{"$f":"HLOOKUP(D1039,'Coding and Prices'!A1331:BF1332,2,0)","v":"E15"},"-","F10","-",null,{"$f":"HLOOKUP(E1039,'Coding and Prices'!A1440:F1441,2,0)","v":"G09"},1,null,{"$f":"(HLOOKUP(D1039,'Coding and Prices'!A1427:BF1428,2,0))*1.85","v":19.425000000000001},0]
[null,null,"Crystal Glass","2mm","Standard Blue",null,920,"-",{"$f":"HLOOKUP(D1040,'Coding and Prices'!A1331:BF1332,2,0)","v":"E20"},"-","F11","-",null,{"$f":"HLOOKUP(E1040,'Coding and Prices'!A1440:F1441,2,0)","v":"G09"},1,null,{"$f":"(HLOOKUP(D1040,'Coding and Prices'!A1427:BF1428,2,0))*1.85","v":19.425000000000001},0]
[null,null,"Ceramic","1.0mm","Standard Blue",null,920,"-",{"$f":"HLOOKUP(D1041,'Coding and Prices'!A1331:BF1332,2,0)","v":"E10"},"-","F12","-",null,{"$f":"HLOOKUP(E1041,'Coding and Prices'!A1440:F1441,2,0)","v":"G09"},1,null,{"$f":"(HLOOKUP(D1041,'Coding and Prices'!A1427:BF1428,2,0))*1.85","v":19.425000000000001},0]
[null,null,"Nylon Grade 1","2mm","Standard",null,920,"-",{"$f":"HLOOKUP(D1042,'Coding and Prices'!A1331:BF1332,2,0)","v":"E20"},"-","F13","-",null,{"$f":"HLOOKUP(E1042,'Coding and Prices'!A1440:F1441,2,0)","v":"G55"},1,null,{"$f":"(HLOOKUP(D1042,'Coding and Prices'!A1427:BF1428,2,0))*1.85","v":19.425000000000001},0]
[null,null,"Zirconia","1.0mm","Standard Blue",null,920,"-",{"$f":"HLOOKUP(D1043,'Coding and Prices'!A1331:BF1332,2,0)","v":"E10"},"-","F15","-",null,{"$f":"HLOOKUP(E1043,'Coding and Prices'!A1440:F1441,2,0)","v":"G09"},1,null,{"$f":"(HLOOKUP(D1043,'Coding and Prices'!A1427:BF1428,2,0))*1.85","v":19.425000000000001},0]
[null,null,"Stainless Steel 316 Wire","3.0mm","Standard Red",null,920,"-",{"$f":"HLOOKUP(D1044,'Coding and Prices'!A1331:BF1332,2,0)","v":"E28"},"-","F16","-",null,{"$f":"HLOOKUP(E1044,'Coding and Prices'!A1440:F1441,2,0)","v":"G20"},1,null,{"$f":"(HLOOKUP(D1044,'Coding and Prices'!A1427:BF1428,2,0))*1.85","v":19.425000000000001},0]
[null,null,"Copper Wire","3.0mm","Standard Blue",null,920,null,{"$f":"HLOOKUP(D1045,'Coding and Prices'!A1331:BF1332,2,0)","v":"E28"},"-","F23","-",null,{"$f":"HLOOKUP(E1045,'Coding and Prices'!A1440:F1441,2,0)","v":"G09"},1,null,{"$f":"(HLOOKUP(D1045,'Coding and Prices'!A1427:BF1428,2,0))*1.85","v":19.425000000000001},0]
[]
[]
[null,null,"Test Stick Contaminant","Contaminant Size","Contaminant Type"]
[null,"X-Ray Test Puck\n\nOther Size are available upon Request","Ferrous","0.25mm","Standard Blue",null,914,"-",{"$f":"HLOOKUP(D1049,'Coding and Prices'!A1331:BF1332,2,0)","v":"E01"},"-","F01","-",null,{"$f":"HLOOKUP(E1049,'Coding and Prices'!A1440:F1441,2,0)","v":"G09"},1,null,{"$f":"(HLOOKUP(D1049,'Coding and Prices'!A1427:BF1428,2,0))*1.85","v":19.425000000000001},{"$f":"P1049*Q1049","v":0}]
[null,null,"Non Ferrous","0.3mm","Standard Blue",null,914,"-",{"$f":"HLOOKUP(D1050,'Coding and Prices'!A1331:BF1332,2,0)","v":"E02"},"-","F02","-",null,{"$f":"HLOOKUP(E1050,'Coding and Prices'!A1440:F1441,2,0)","v":"G09"},1,null,{"$f":"(HLOOKUP(D1050,'Coding and Prices'!A1427:BF1428,2,0))*1.85","v":19.425000000000001},{"$f":"P1050*Q1050","v":0}]
[null,null,"Stainless Steel 316","0.3mm","Standard",null,914,"-",{"$f":"HLOOKUP(D1051,'Coding and Prices'!A1331:BF1332,2,0)","v":"E02"},"-","F03","-",null,{"$f":"HLOOKUP(E1051,'Coding and Prices'!A1440:F1441,2,0)","v":"G55"},1,null,{"$f":"(HLOOKUP(D1051,'Coding and Prices'!A1427:BF1428,2,0))*1.85","v":19.425000000000001},{"$f":"P1051*Q1051","v":0}]
[null,null,"Stainless Steel 304","0.5mm","Standard Red",null,914,"-",{"$f":"HLOOKUP(D1052,'Coding and Prices'!A1331:BF1332,2,0)","v":"E05"},"-","F04","-",null,{"$f":"HLOOKUP(E1052,'Coding and Prices'!A1440:F1441,2,0)","v":"G20"},1,null,{"$f":"(HLOOKUP(D1052,'Coding and Prices'!A1427:BF1428,2,0))*1.85","v":19.425000000000001},0]
[null,null,"Aluminium","0.8mm","Standard Blue",null,914,"-",{"$f":"HLOOKUP(D1053,'Coding and Prices'!A1331:BF1332,2,0)","v":"E08"},"-","F07","-",null,{"$f":"HLOOKUP(E1053,'Coding and Prices'!A1440:F1441,2,0)","v":"G09"},1,null,{"$f":"(HLOOKUP(D1053,'Coding and Prices'!A1427:BF1428,2,0))*1.85","v":19.425000000000001},0]
[null,null,"Ph Bronze","1.5mm","Standard Blue",null,914,"-",{"$f":"HLOOKUP(D1054,'Coding and Prices'!A1331:BF1332,2,0)","v":"E15"},"-","F08","-",null,{"$f":"HLOOKUP(E1054,'Coding and Prices'!A1440:F1441,2,0)","v":"G09"},1,null,{"$f":"(HLOOKUP(D1054,'Coding and Prices'!A1427:BF1428,2,0))*1.85","v":19.425000000000001},0]
[null,null,"Soda Lime Glass","1.0mm","Standard Blue",null,914,"-",{"$f":"HLOOKUP(D1055,'Coding and Prices'!A1331:BF1332,2,0)","v":"E10"},"-","F09","-",null,{"$f":"HLOOKUP(E1055,'Coding and Prices'!A1440:F1441,2,0)","v":"G09"},1,null,{"$f":"(HLOOKUP(D1055,'Coding and Prices'!A1427:BF1428,2,0))*1.85","v":19.425000000000001},0]
[null,null,"Teflon (PTFE)","1.5mm","Standard Blue",null,914,"-",{"$f":"HLOOKUP(D1056,'Coding and Prices'!A1331:BF1332,2,0)","v":"E15"},"-","F10","-",null,{"$f":"HLOOKUP(E1056,'Coding and Prices'!A1440:F1441,2,0)","v":"G09"},1,null,{"$f":"(HLOOKUP(D1056,'Coding and Prices'!A1427:BF1428,2,0))*1.85","v":19.425000000000001},0]
[null,null,"Crystal Glass","2mm","Standard Blue",null,914,"-",{"$f":"HLOOKUP(D1057,'Coding and Prices'!A1331:BF1332,2,0)","v":"E20"},"-","F11","-",null,{"$f":"HLOOKUP(E1057,'Coding and Prices'!A1440:F1441,2,0)","v":"G09"},1,null,{"$f":"(HLOOKUP(D1057,'Coding and Prices'!A1427:BF1428,2,0))*1.85","v":19.425000000000001},0]
[null,null,"Ceramic","1.0mm","Standard Blue",null,914,"-",{"$f":"HLOOKUP(D1058,'Coding and Prices'!A1331:BF1332,2,0)","v":"E10"},"-","F12","-",null,{"$f":"HLOOKUP(E1058,'Coding and Prices'!A1440:F1441,2,0)","v":"G09"},1,null,{"$f":"(HLOOKUP(D1058,'Coding and Prices'!A1427:BF1428,2,0))*1.85","v":19.425000000000001},0]
[null,null,"Nylon Grade 1","2mm","Standard",null,914,"-",{"$f":"HLOOKUP(D1059,'Coding and Prices'!A1331:BF1332,2,0)","v":"E20"},"-","F13","-",null,{"$f":"HLOOKUP(E1059,'Coding and Prices'!A1440:F1441,2,0)","v":"G55"},1,null,{"$f":"(HLOOKUP(D1059,'Coding and Prices'!A1427:BF1428,2,0))*1.85","v":19.425000000000001},0]
[null,null,"Zirconia","1.0mm","Standard Blue",null,914,"-",{"$f":"HLOOKUP(D1060,'Coding and Prices'!A1331:BF1332,2,0)","v":"E10"},"-","F15","-",null,{"$f":"HLOOKUP(E1060,'Coding and Prices'!A1440:F1441,2,0)","v":"G09"},1,null,{"$f":"(HLOOKUP(D1060,'Coding and Prices'!A1427:BF1428,2,0))*1.85","v":19.425000000000001},0]
[null,null,"Stainless Steel 316 Wire","3.0mm","Standard Red",null,914,"-",{"$f":"HLOOKUP(D1061,'Coding and Prices'!A1331:BF1332,2,0)","v":"E28"},"-","F16","-",null,{"$f":"HLOOKUP(E1061,'Coding and Prices'!A1440:F1441,2,0)","v":"G20"},1,null,{"$f":"(HLOOKUP(D1061,'Coding and Prices'!A1427:BF1428,2,0))*1.85","v":19.425000000000001},0]
[null,null,"Copper Wire","3.0mm","Standard Blue",null,914,null,{"$f":"HLOOKUP(D1062,'Coding and Prices'!A1331:BF1332,2,0)","v":"E28"},"-","F23","-",null,{"$f":"HLOOKUP(E1062,'Coding and Prices'!A1440:F1441,2,0)","v":"G09"},1,null,{"$f":"(HLOOKUP(D1062,'Coding and Prices'!A1427:BF1428,2,0))*1.85","v":19.425000000000001},0]
[]
[null,"Test Balls"]
[]
[null,null,"Test Stick Contaminant","Contaminant Size","Contaminant Type"]
[null,"Test Balls\n\nOther Size are available upon Request","Ferrous","0.25mm","Standard Blue",null,914,"-",{"$f":"HLOOKUP(D1067,'Coding and Prices'!A1331:BF1332,2,0)","v":"E01"},"-","F01","-",null,{"$f":"HLOOKUP(E1067,'Coding and Prices'!A1440:F1441,2,0)","v":"G09"},1,null,34.225000000000001,{"$f":"P1067*Q1067","v":0}]
[null,null,"Non Ferrous","0.3mm","Standard Blue",null,914,"-",{"$f":"HLOOKUP(D1068,'Coding and Prices'!A1331:BF1332,2,0)","v":"E02"},"-","F02","-",null,{"$f":"HLOOKUP(E1068,'Coding and Prices'!A1440:F1441,2,0)","v":"G09"},1,null,34.225000000000001,{"$f":"P1068*Q1068","v":0}]
[null,null,"Stainless Steel 316","0.3mm","Standard",null,914,"-",{"$f":"HLOOKUP(D1069,'Coding and Prices'!A1331:BF1332,2,0)","v":"E02"},"-","F03","-",null,{"$f":"HLOOKUP(E1069,'Coding and Prices'!A1440:F1441,2,0)","v":"G55"},1,null,34.225000000000001,{"$f":"P1069*Q1069","v":0}]
[null,null,"Stainless Steel 304","0.5mm","Standard Red",null,914,"-",{"$f":"HLOOKUP(D1070,'Coding and Prices'!A1331:BF1332,2,0)","v":"E05"},"-","F04","-",null,{"$f":"HLOOKUP(E1070,'Coding and Prices'!A1440:F1441,2,0)","v":"G20"},1,null,34.225000000000001,0]
[null,null,"Aluminium","0.8mm","Standard Blue",null,914,"-",{"$f":"HLOOKUP(D1071,'Coding and Prices'!A1331:BF1332,2,0)","v":"E08"},"-","F07","-",null,{"$f":"HLOOKUP(E1071,'Coding and Prices'!A1440:F1441,2,0)","v":"G09"},1,null,34.225000000000001,0]
[null,null,"Ph Bronze","1.5mm","Standard Blue",null,914,"-",{"$f":"HLOOKUP(D1072,'Coding and Prices'!A1331:BF1332,2,0)","v":"E15"},"-","F08","-",null,{"$f":"HLOOKUP(E1072,'Coding and Prices'!A1440:F1441,2,0)","v":"G09"},1,null,34.225000000000001,0]
[null,null,"Soda Lime Glass","1.0mm","Standard Blue",null,914,"-",{"$f":"HLOOKUP(D1073,'Coding and Prices'!A1331:BF1332,2,0)","v":"E10"},"-","F09","-",null,{"$f":"HLOOKUP(E1073,'Coding and Prices'!A1440:F1441,2,0)","v":"G09"},1,null,34.225000000000001,0]
[null,null,"Teflon (PTFE)","1.5mm","Standard Blue",null,914,"-",{"$f":"HLOOKUP(D1074,'Coding and Prices'!A1331:BF1332,2,0)","v":"E15"},"-","F10","-",null,{"$f":"HLOOKUP(E1074,'Coding and Prices'!A1440:F1441,2,0)","v":"G09"},1,null,34.225000000000001,0]
[null,null,"Crystal Glass","2mm","Standard Blue",null,914,"-",{"$f":"HLOOKUP(D1075,'Coding and Prices'!A1331:BF1332,2,0)","v":"E20"},"-","F11","-",null,{"$f":"HLOOKUP(E1075,'Coding and Prices'!A1440:F1441,2,0)","v":"G09"},1,null,34.225000000000001,0]
[null,null,"Ceramic","1.0mm","Standard Blue",null,914,"-",{"$f":"HLOOKUP(D1076,'Coding and Prices'!A1331:BF1332,2,0)","v":"E10"},"-","F12","-",null,{"$f":"HLOOKUP(E1076,'Coding and Prices'!A1440:F1441,2,0)","v":"G09"},1,null,34.225000000000001,0]
[null,null,"Nylon Grade 1","2mm","Standard",null,914,"-",{"$f":"HLOOKUP(D1077,'Coding and Prices'!A1331:BF1332,2,0)","v":"E20"},"-","F13","-",null,{"$f":"HLOOKUP(E1077,'Coding and Prices'!A1440:F1441,2,0)","v":"G55"},1,null,34.225000000000001,0]
[null,null,"Zirconia","1.0mm","Standard Blue",null,914,"-",{"$f":"HLOOKUP(D1078,'Coding and Prices'!A1331:BF1332,2,0)","v":"E10"},"-","F15","-",null,{"$f":"HLOOKUP(E1078,'Coding and Prices'!A1440:F1441,2,0)","v":"G09"},1,null,34.225000000000001,0]
[null,null,"Stainless Steel 316 Wire","3.0mm","Standard Red",null,914,"-",{"$f":"HLOOKUP(D1079,'Coding and Prices'!A1331:BF1332,2,0)","v":"E28"},"-","F16","-",null,{"$f":"HLOOKUP(E1079,'Coding and Prices'!A1440:F1441,2,0)","v":"G20"},1,null,34.225000000000001,0]
[null,null,"Copper Wire","3.0mm","Standard Blue",null,914,null,{"$f":"HLOOKUP(D1080,'Coding and Prices'!A1331:BF1332,2,0)","v":"E28"},"-","F23","-",null,{"$f":"HLOOKUP(E1080,'Coding and Prices'!A1440:F1441,2,0)","v":"G09"},1,null,34.225000000000001,0]
[]
[]
[]
["The order will be shipped UPS ground or USPS unless otherwise specified. Shipping costs will be added to the order total."]
[]
["Payment (P-Card or Credit Card)",null,"Ship to address","Bill to address (if different)"]
["Card #:"]
["Expirtion:"]
["Email:"]

{"sheet":"Coding and Prices","index":1,"n_rows":1493,"n_cols":79,"rows_kept":1493,"cut":false,"hidden":false,"merged":[]}
[null,"HD Retractable","Elephant Retractable","Blue","Black","Red","Green","Blue Gel","Black Gel","Red Gel","Green Gel","Blue Cryo","Black Cryo","Blue Fine Tip","Black Fine Tip","Blue Housing","Black Housing","Red Housing","Green Housing","Yellow Housing","White Housing","Purple Housing","Orange Housing","Pink Housing","Blue End","Black End","Red End","Green End","Yellow End","White End","Purple End","Orange End","Pink End","With Clip","Without Clip","With Lanyard Attachment"]
["Retractable Pen Type",101,104]
["Ink",null,null,"I01","I02","I03","I04","I21","I22","I23","I24","I11","I12","I31","I32"]
["Housing",null,null,null,null,null,null,null,null,null,null,null,null,null,null,"C1","C2","C3","C4","C5","C6","C7","C8","C9"]
["End Cap",null,null,null,null,null,null,null,null,null,null,null,null,null,null,null,null,null,null,null,null,null,null,null,1,2,3,4,5,6,7,8,9]
["Attachment",null,null,null,null,null,null,null,null,null,null,null,null,null,null,null,null,null,null,null,null,null,null,null,null,null,null,null,null,null,null,null,null,"PA01","PA02","PA03"]
[]
["Pen Type","Blue","Black","Red","Green","Blue Gel","Black Gel","Red Gel","Green Gel","Blue Cryo","Black Cryo","Blue Fine Tip","Black Fine Tip"]
["Elephant Retractable",61,61,61,61,127.5,127.5,127.5,127.5,150,150,116.5,116.5]
["HD Retractable",68.5,68.5,68.5,68.5,142.5,142.5,142.5,142.5,162,162,137,137]
[]
[null,"HD Stick","Elephant Stick","Blue","Black","Red","Green","Blue Housing","Black Housing","Red Housing","Green Housing","Yellow Housing","White Housing","Purple Housing","Orange Housing","Pink Housing","With Clip","Without Clip","With Lanyard Attachment"]
["Stick Pen Type",116,105]
["Ink",null,null,"I01","I02","I03","I04"]
["Housing",null,null,null,null,null,null,"C101","C110","C103","C104","C105","C160","C107","C108","C109"]
["Attachment",null,null,null,null,null,null,null,null,null,null,null,null,null,null,null,"PA01","PA02","PA03"]
[]
["Pen Type","Price",null,"Pen Type","Blue","Black","Red","Green",null,"Marker Pen Type","Food Marker","Meat Marker","Blue","Red"]
["Elephant Stick",35,null,"SP Stick Pen","I01","I02","I03","I04",null,"Marker Type","T040","T041"]
["HD Stick",40,null,null,null,null,null,null,null,"Ink",null,null,"P01","P03"]
[]
[null,"Standard (No Clip)","With Split Ring","With Pocket Clip","Blue","Black","Red","Green","Blue Gel","Black Gel","Red Gel","Green Gel","Blue Cryo","Black Cryo","Blue Fine Tip","Black Fine Tip"]
["Ink",null,null,null,"I01","I02","I03","I04","I21","I22","I23","I24","I11","I12","I31","I32"]
["Attachment","PA05","PA04","PA01"]
[]
["Pen Type","Blue","Black","Red","Green","Blue Gel","Black Gel","Red Gel","Green Gel","Blue Cryo","Black Cryo","Blue Fine Tip","Black Fine Tip"]
["Standard (No Clip)",90.5,90.5,90.5,90.5,174,174,174,174,188.5,188.5,157.5,157.5]
["With Split Ring",102,102,102,102,174,174,174,174,188.5,188.5,157.5,157.5]
["With Pocket Clip",102,102,102,102,174,174,174,174,188.5,188.5,157.5,157.5]
[]
[null,"Stainless Steel Pen","Stainless Steel Managers Pen","Blue","Black","Red","Green","Blue Gel","Black Gel","Red Gel","Green Gel","Blue Cryo","Black Cryo","Blue Fine Tip","Black Fine Tip"]
["Pen Type",114,113]
["Ink",null,null,"I01","I02","I03","I04","I21","I22","I23","I24","I11","I12","I31","I32"]
[]
["Pen Type","Blue","Black","Red","Green","Blue Gel","Black Gel","Red Gel","Green Gel","Blue Cryo","Black Cryo","Blue Fine Tip","Black Fine Tip"]
["Stainless Steel Pen",18,18,18,18,22.5,22.5,22.5,22.5,27.5,27.5,21,21]
["Stainless Steel Managers Pen",20,20,20,20,24,24,24,24,36,36,27.5,27.5]
[]
[null,"Whiteboard Marker","Permanent Marker","Retractable","Non Retractable","Blue","Black","Red","Green","Bullet Tip","Chisel Tip"]
["Marker Pen Type",145,146]
["Retractable?",null,null,"A05","A06"]
["Ink",null,null,null,null,"P01","P02","P03","P04"]
["Tip Type",null,null,null,null,null,null,null,null,"A07","A08"]
[]
["Pen Type"]
["Retractable",15.2]
["Non Retractable",11.5]
[]
["Pen Type"]
["Retractable",6.2475000000000005,null,null,null,null,null,null,1.08]
["Non Retractable",5.8]
[]
[]
[]
[null,"Retractable","Non Retractable","Blue","Green","Yellow","Orange","Pink"]
["Highlighter"]
["Retractable?","A05","A06"]
["Ink",null,null,"P01","P04","P05","P08","P09"]
[]
[null,"A3 Portrait","A3 Landscape","A4 Portrait","A4 Landscape","A5 Portrait","A5 Landscape","Blue","Black","Red","Green","Yellow","White","Purple","Orange","Pink","HD St/St Clip","Economy St/St Clip","Economy Chrome Plated","Zinc Clip & Pen Holder","Jumbo Clip","Blue HD St/St Clip","Red HD St/St Clip","Green HD St/St Clip","Yellow HD St/St Clip","Blue Econ Chrome Clip","Red Econ Chrome Clip","Green Econ Chrome Clip","Yellow Econ Chrome Clip"]
["Clipboard Type"]
["Size/Orientation","O07","O04","O06","O05","O08","O21"]
["Colour/Material",null,null,null,null,null,null,"P01","P02","P03","P04","P05","P06","P07","P08","P09"]
["Attachment",null,null,null,null,null,null,null,null,null,null,null,null,null,null,null,"A10","A11","A12","A13","A94","A15","A16","A19","A24","A124","A128","A132","A133"]
[]
["Clipboard Type","HD St/St Clip","Economy St/St Clip","Economy Chrome Plated","Zinc Clip & Pen Holder","Jumbo Clip","Blue HD St/St Clip","Red HD St/St Clip","Green HD St/St Clip","Yellow HD St/St Clip","Blue Econ Chrome Clip","Red Econ Chrome Clip","Green Econ Chrome Clip","Yellow Econ Chrome Clip"]
["A3 Landscape",11.793600000000001,9.5472000000000001,8.877600000000001,10.0008,0,10.616400000000001,10.616400000000001,10.616400000000001,10.616400000000001,9.8800000000000008,9.8800000000000008,9.8800000000000008,9.8800000000000008]
["A4 Landscape",9.3312000000000008,7.5276000000000005,6.7932000000000006,7.9164000000000003,0,9.0504000000000016,9.0504000000000016,9.0504000000000016,9.0504000000000016,7.79,7.79,7.79,7.79]
["A5 Landscape",8.1972000000000005,6.0048000000000004,5.508,6.6311999999999998,0,8.0568000000000008,8.0568000000000008,8.0568000000000008,8.0568000000000008,6.51,6.51,6.51,6.51]
["A3 Portrait",11.793600000000001,9.5472000000000001,8.877600000000001,10.0008,0,10.616400000000001,10.616400000000001,10.616400000000001,10.616400000000001,9.8800000000000008,9.8800000000000008,9.8800000000000008,9.8800000000000008]
["A4 Portrait",8.6292000000000009,7.5276000000000005,6.7932000000000006,7.9164000000000003,0,9.0504000000000016,9.0504000000000016,9.0504000000000016,9.0504000000000016,7.79,7.79,7.79,7.79]
["A5 Portrait",8.1972000000000005,6.0048000000000004,5.508,6.6311999999999998,0,8.0568000000000008,8.0568000000000008,8.0568000000000008,8.0568000000000008,6.51,6.51,6.51,6.51]
[]
[null,"A3 Portrait","A3 Landscape","A4 Portrait","A4 Landscape","A5 Portrait","A5 Landscape","HD St/St Clip","Economy St/St Clip","Economy Chrome Plated","Zinc Clip & Pen Holder","Jumbo Clip","Blue HD St/St Clip","Red HD St/St Clip","Green HD St/St Clip","Yellow HD St/St Clip","Blue Econ Chrome Clip","Red Econ Chrome Clip","Green Econ Chrome Clip","Yellow Econ Chrome Clip"]
["Clipboard Type"]
["Size/Orientation","O07","O04","O06","O05","O08","O21"]
["Attachment",null,null,null,null,null,null,"A10","A11","A12","A13","A94","A15","A16","A19","A24","A124","A128","A132","A133"]
[]
["Clipboard Type","HD St/St Clip","Economy St/St Clip","Economy Chrome Plated","Zinc Clip & Pen Holder","Jumbo Clip","Blue HD St/St Clip","Red HD St/St Clip","Green HD St/St Clip","Yellow HD St/St Clip","Blue Econ Chrome Clip","Red Econ Chrome Clip","Green Econ Chrome Clip","Yellow Econ Chrome Clip"]
["A3 Landscape",23.252400000000002,21.578400000000002,21.016800000000003,22.14,0,24.25,24.25,24.25,24.25,22.02,22.02,22.02,22.02]
["A4 Landscape",13.748400000000002,12.063600000000001,11.502000000000001,12.6252,0,14.75,14.75,14.75,14.75,12.5,12.5,12.5,12.5]
["A5 Landscape",9.5472000000000001,7.8084000000000007,6.6852000000000009,7.8084000000000007,0,10.55,10.55,10.55,10.55,7.79,7.79,7.79,7.79]
["A3 Portrait",23.252400000000002,21.578400000000002,21.016800000000003,22.14,0,24.25,24.25,24.25,24.25,22.02,22.02,22.02,22.02]
["A4 Portrait",13.748400000000002,12.063600000000001,11.502000000000001,12.6252,0,14.75,14.75,14.75,14.75,12.5,12.5,12.5,12.5]
["A5 Portrait",9.5472000000000001,7.8084000000000007,6.6852000000000009,7.8084000000000007,0,10.55,10.55,10.55,10.55,7.79,7.79,7.79,7.79]
[]
["Clipboard Type","HD St/St Clip","Economy St/St Clip","Economy Chrome Plated","Zinc Clip & Pen Holder","Jumbo Clip","Blue HD St/St Clip","Red HD St/St Clip","Green HD St/St Clip","Yellow HD St/St Clip","Blue Econ Chrome Clip","Red Econ Chrome Clip","Green Econ Chrome Clip","Yellow Econ Chrome Clip"]
["A3 Landscape",21.7944,20.109600000000004,19.548000000000002,20.671200000000002,0]
["A4 Landscape",9.514800000000001,7.83,7.2684000000000006,8.3916000000000004,0,25,null,null,null,22]
["A5 Landscape",7.3008000000000006,0,0,0,0]
["A3 Portrait",21.7944,20.109600000000004,19.548000000000002,20.671200000000002,0]
["A4 Portrait",9.514800000000001,7.83,7.2684000000000006,8.3916000000000004,0,25,null,null,null,22]
["A5 Portrait",7.3008000000000006,0,0,0,0]
[]
["Clipboard Type","A4 Aluminium","A4 Stainless Steel"]
["Attachment","HD St/St Clip","Economy St/St Clip","Economy Chrome Plated","Zinc Clip & Pen Holder"]
[]
["Clipboard Type","A4 Aluminium","A4 Stainless Steel","HD St/St Clip","Economy St/St Clip","Economy Chrome Plated","Zinc Clip & Pen Holder"]
[null,"P30","P45"]
[null,null,null,"A10","A11","A12","A13"]
[]
["Clipboard Type","HD St/St Clip","Economy St/St Clip","Economy Chrome Plated","Zinc Clip & Pen Holder"]
["A4 Aluminium",18.306000000000001,16.847999999999999,15.768000000000001,16.081200000000003]
["A4 Stainless Steel",28.080000000000002,24.5916,23.025600000000001,23.641200000000001]
[]
["Colour Coded Clipboard Clips (HD ST/ST)","Blue","Red","Green","Yellow"]
[null,"T089","T090","T091","T092"]
[]
["Colour Coded Clipboard Clips (HD ST/ST)","Blue","Red","Green","Yellow"]
[null,24.1,24.1,24.1,24.1]
[]
["Colour Coded Clipboard Clips (Econ Chrome)","Blue","Red","Green","Yellow"]
[null,"T140","T141","T142","T143"]
[]
["Colour Coded Clipboard Clips (Econ Chrome)","Blue","Red","Green","Yellow"]
[null,9.5,9.5,9.5,9.5]
[]
["Bulldog Clip Size","75mm (3\")","145mm (5.7\")"]
[]
["Bulldog Clip Size","75mm (3\")","145mm (5.7\")"]
[null,"S393","S392"]
[]
["Bulldog Clip Size","75mm (3\")","145mm (5.7\")"]
[null,21.6,24.5]
[]
[]
[]
[]
["Clipboard Type","A3","A4"]
["Attachment","HD St/St Clip","Economy St/St Clip","Economy Chrome Plated","Zinc Clip & Pen Holder"]
[]
[null,"A4","A3","HD St/St Clip","Economy St/St Clip","Economy Chrome Plated","Zinc Clip & Pen Holder"]
["Clipboard Size","O17","O03"]
["Attachment",null,null,"A10","A11","A12","A13"]
[]
["Clipboard Type","HD St/St Clip","Economy St/St Clip","Economy Chrome Plated","Zinc Clip & Pen Holder"]
["A4 Stainless Steel",25.95,24.91,23.87,23.29]
[]
["Clipboard Type","HD St/St Clip","Economy St/St Clip","Economy Chrome Plated","Zinc Clip & Pen Holder"]
["A4",17.225999999999999,15.768000000000001,14.688000000000001,15.001200000000001]
["A3",23.284800000000001,15.768000000000001,21.740400000000001,23.284800000000001]
[]
[]
["Clipboard Clips Type","Stainless Steel  Heavy Duty","120 x 30mm economy chrome plated  (with hook)","120 x 30mm economy stainless steel (with hook)","Econ Chrome plated 100mm width","Econ Chrome plated 120mm width","Jumbo Chrome Plated","Zinc Plated clip with pen holder"]
[]
["Clipboard Clips Type","Stainless Steel  Heavy Duty","120 x 30mm economy chrome plated (with hook)","120 x 30mm economy stainless steel (with hook)","Econ Chrome plated 100mm width","Econ Chrome plated 120mm width","Jumbo Chrome Plated","Zinc Plated clip with pen holder"]
[null,"T185","T186","T187","T093","T094","T232","T188"]
[]
["Clipboard Clips Type","Stainless Steel  Heavy Duty","120 x 30mm economy chrome plated (with hook)","120 x 30mm economy stainless steel (with hook)","Econ Chrome plated 100mm width","Econ Chrome plated 120mm width","Jumbo Chrome Plated","Zinc Plated clip with pen holder"]
[null,18.899999999999999,9.1,12.1,6.5,7.55,12.75,10.3]
[]
[]
[]
["Scoop Type","Mini 175g","Small 500g","Medium 750g","Large 1000g","Blue","Black","Red","Green","Yellow","White","Purple ","Orange","Pink"]
["Size","S085","S086","S087","S088"]
["Colour",null,null,null,null,"P01","P02","P03","P04","P05","P06","P07","P08","P09"]
[]
["Scoop Type","Mini 175g","Small 500g","Medium 750g","Large 1000g"]
["Price",9.3000000000000007,15.552000000000001,31.55,45.5]
[]
["Scoop Type","Small 250ml","Medium 500ml","Large 1000ml","Blue","Red"]
["Size","S089 - S048","S090 - S050","S091 - S051"]
["Colour",null,null,null,"P01","P03"]
[]
["Scoop Type","Small 250ml","Medium 500ml","Large 1000ml"]
["Price",20.196000000000002,22.248000000000005,23.85]
[]
["Round Bowl Scoop","Blue","Black","Red","Green","Yellow","White","Purple ","Orange","Pink"]
[null,"P01","P02","P03","P04","P05","P06","P07","P08","P09"]
[]
["Scooping  Jug","Blue","Black","Red","Green","Yellow","White","Purple ","Orange","Pink"]
[null,"P01","P02","P03","P04","P05","P06","P07","P08","P09"]
[]
["Stackable Pouring  Jug","Blue","Black","Red","Green","Yellow","White","Purple ","Orange","Pink"]
[null,"P01","P02","P03","P04","P05","P06","P07","P08","P09"]
[]
["Stackable Pouring  Jug","Blue","Red"]
[null,"P01","P03"]
[]
[]
["Pen Ink Type","Economy Refill","Stick Pen Refill","Retractable Refill","Gel Ink Refill"]
["Colour","Blue","Black","Red","Green"]
[]
["Ink Type","Economy Refill","Stick Pen Refill","Standard Refill","Blue","Black","Red","Green","Blue Gel ","Black Gel","Red Gel","Green Gel","Blue","Black","Red","Green"]
["Pen Refill Type",124,117,100]
["Colour",null,null,null,"I01","I02","I03","I04","I01","I02","I03","I04","I01","I02","I03","I04"]
[]
[null,"Blue","Black","Red","Green"]
["Gel","I21","I22","I23","I24"]
["Cryo","I11","I12"]
["Fine Tip","I31","I32"]
["Standard","I01","I02","I03","I04"]
[]
[]
["Type","Handheld","Desktop","Pocket"]
["Magnetic status","Magnetic","Non Magnetic"]
[]
["Type","Magnetic","Non Magnetic","Desktop","Handheld","Pocket","Blue","Black","Red","Green","Yellow","White","Purple","Orange","Pink"]
["Magnetic Status",214,200]
["Type",null,null,"D","H","P"]
[null,null,null,null,null,null,"P01","P02","P03","P04","P05","P06","P07","P08","P09"]
[]
["Calculator Type","Desktop","Handheld","Pocket"]
["Magnetic",9.6660000000000004,6.426000000000001,6.426000000000001]
["Non Magnetic",6.426000000000001,3.1860000000000004,3.1860000000000004]
[]
["Calculator Type","Desktop","Handheld","Pocket"]
[]
["Type","Desktop","Handheld","Pocket"]
[null,"D","H","P"]
[]
["Type","Desktop","Handheld","Pocket"]
[null,17.539200000000001,11.221200000000001,11.221200000000001]
[]
["Ruler Type","150mm (6\")","300mm (12\")"]
[]
["Type","150mm (6\")","300mm (12\")"]
[null,"S069","S075"]
[]
["Type","150mm (6\")","300mm (12\")"]
[null,4.1040000000000001,5.5]
[]
["Stainless Steel Ruler Type","150mm (6\")","300mm (12\")","450mm (18\")"]
[]
["Type","150mm (6\")","300mm (12\")","450mm (18\")"]
[null,"S069","S075","S080"]
[]
["Type","150mm (6\")","300mm (12\")","450mm (18\")"]
[null,0.66960000000000008,1.1772000000000002,3.0888]
[]
["Flexi Scraper Type","Small","Large"]
[]
["Flexi Scraper Type","Small","Large","Blue","Black","Red","Green","Yellow","White","Purple","Orange","Pink"]
[null,"TO95","TO96"]
[null,null,null,"P01","P02","P03","P04","P05","P06","P07","P08","P09"]
[]
["Flexi Scraper Type","Small","Large"]
[null,2.8,10.199999999999999]
[]
["Serrated Edge Scraper Type","Small","Large"]
[]
["Serrated Edge Scraper Type","Small","Large","Blue","Black","Red","Green","Yellow","White","Purple","Orange","Pink"]
[null,"S089","S091"]
[null,null,null,"P01","P02","P03","P04","P05","P06","P07","P08","P09"]
[]
["Serrated Edge  Scraper Type","Small","Large"]
[null,5.4,8.6999999999999993]
[]
[]
["Hand  Scraper Size","3\"","4\""]
[]
["Hand  Scraper Size","3\"","4\"","Blue","Black","Red","Green","Yellow","White","Purple","Orange","Pink"]
[null,"S104","S105"]
[null,null,null,"P01","P02","P03","P04","P05","P06","P07","P08","P09"]
[]
["Hand  Scraper Size","3\"","4\""]
[null,7.8,11]
[]
["Scrapers - Plastic/Metal Type","Flexi -  Blade Size = 120mm (4.7\")","Rigid - Blade Size = 150mm  (5.9\")"]
[]
["Scrapers - Plastic/Metal Type","Flexi -  Blade Size = 120mm (4.7\")","Rigid - Blade Size = 150mm  (5.9\")"]
[null,"S095","S096"]
[]
["Scrapers - Plastic/Metal Type","Flexi -  Blade Size = 120mm (4.7\")","Rigid - Blade Size = 150mm  (5.9\")"]
[null,7.4,12.1]
[]
["Stainless Steel Scrapers Type","Flexi","Rigid"]
[]
["Stainless Steel Scrapers Type","Flexi","Rigid"]
[null,"T095","T096"]
[]
["Stainless Steel Scrapers Type","Flexi","Rigid"]
[null,4.4000000000000004,5.8536000000000001]
[]
["Stirrer/Scraper Type","With Holes","Without Holes"]
[]
["Stirrer/Scraper Type","With Holes","Without Holes","Blue","Red","Green","Yellow","White"]
[null,"A50","A51"]
[null,null,null,"P01","P03","P04","P05","P06"]
[]
["Stirrer/Scraper Type","With Holes","Without Holes"]
[null,3.6504000000000003,3.8772000000000002]
[]
["Spatula","Blue","Red","Green","Yellow","White"]
[null,"P01","P03","P04","P05","P06"]
[]
[]
[]
[]
["Shovel Type","Hand Shovel","Large Shovel"]
[]
["Shovel Type","Hand Shovel","Large Shovel"]
[null,"S246","S248"]
[]
["Shovel Type","Hand Shovel","Large Shovel"]
[null,36.288000000000004,63.374400000000001]
[]
["Easygrip Pen Sleeve Type","Single Pen Sleeve","Pen Sleeve x1metre Length"]
[]
["Easygrip Pen Sleeve Type","Single Pen Sleeve","Pen Sleeve x1metre Length"]
[null,"S060","S084",null,null,null,1.1664000000000001]
[]
["Easygrip Pen Sleeve Type","Single Pen Sleeve","Pen Sleeve x1metre Length"]
[null,10.3,34.299999999999997]
[]
[]
["Stapless Stapler (HD)","Black","Green","Light Blue","Pink","White"]
[null,"P02","P04","P012","P09","P06"]
[]
["Stapless Stapler (HD)","Black","Green","Light Blue","Pink","White"]
[null,10.054800000000002,10.054800000000002,10.054800000000002,10.054800000000002,10.054800000000002]
[]
["Stapless Stapler (MD)","Light Green","Light Blue","Light Pink","Brown","White"]
[null,"P13","P12","P14","P10","P06"]
[]
["Stapless Stapler (MD)","Light Green","Light Blue","Light Pink","Brown","White"]
[null,6.6852000000000009,6.6852000000000009,6.6852000000000009,6.6852000000000009,6.6852000000000009]
[]
["Stainless Steel Ring Binder","A4 Portrait","A3 Landscape","2 Ring","3 Ring","4 Ring"]
[]
["Stainless Steel Ring Binder","A4 Portrait","A3 Landscape","2 Ring","3 Ring","4 Ring"]
[null,"O06","O04"]
[null,null,null,"A30","A32","A34"]
[]
["Stainless Steel Ring Binder","2 Ring","3 Ring","4 Ring"]
["A4 Portrait",24.310800000000004,24.310800000000004,25.369199999999999]
["A3 Landscape",25.855200000000004,25.855200000000004,30.272400000000005]
[]
[]
["Aluminium Ring Binder","A4 Portrait","A3 Portrait","A3 Landscape","2 Ring","3 Ring","4 Ring"]
[]
["Aluminium Ring Binder","A4 Portrait","A3 Portrait","A3 Landscape","2 Ring","3 Ring","4 Ring"]
[null,"O06","O07","O04"]
[null,null,null,null,"A30","A32","A34"]
[]
["Aluminium Ring Binder","2 Ring","3 Ring","4 Ring"]
["A4 Portrait",14.266800000000002,14.266800000000002,14.795999999999999]
["A3 Portrait",26.395200000000003,26.395200000000003,"N/A"]
["A3 Landscape",23.706,23.706,26.395200000000003]
[]
["Colour Coded Ring Binder","Blue","Red","Green","Yellow"]
[null,"P01","P03","P04","P05"]
[]
["Colour Coded Ring Binder","Blue","Red","Green","Yellow"]
[null,19.385999999999999,19.385999999999999,19.385999999999999,19.385999999999999]
[]
["Lever Arch Files","Aluminium","Stainless Steel"]
[null,"P31","P32"]
[]
["Lever Arch Files","Aluminium","Stainless Steel"]
[null,23.048064000000004,27.900288000000003]
[]
["Ring Binder Mechanism","2 ring (30mm diameter rings)","2 ring (43mm diameter ring)","3 ring (30mm diameter ring)","3 ring (43mm diameter ring)","4 ring (43mm diameter rings)"]
[null,"A30","A31","A32","A33","A34"]
[]
["Ring Binder Mechanism","2 ring (30mm diameter rings)","2 ring (43mm diameter ring)","3 ring (30mm diameter ring)","3 ring (43mm diameter ring)","4 ring (43mm diameter rings)"]
[null,10.5,12.3,14.7,14.7,18.100000000000001]
[]
["Anodised Aluminium Mobile Desks","Top Hinged","Side Hinged","Top Hinged","Top Hinged"]
[]
["Anodised Aluminium Mobile Desks","Top Hinged","Side Hinged","Top Hinged","Top Hinged"]
[null,"S791","S792","S793C","S793"]
[]
["Anodised Aluminium Mobile Desks","Top Hinged","Side Hinged","Top Hinged","Top Hinged"]
[null,14.461200000000002,14.461200000000002,16.383600000000001,15.7896]
[]
["Anodised Aluminium Form Holder (Side Hinged)","W - 155mm x L - 260mm x H 20mm","W - 230mm x L - 360mm x H 20mm","W - 230mm x L - 375mm x H 25mm"]
[]
["Anodised Aluminium Form Holder (Side Hinged)","W - 155mm x L - 260mm x H 20mm","W - 230mm x L - 360mm x H 20mm","W - 230mm x L - 375mm x H 25mm"]
[null,"S797","S798","S799"]
[]
["Anodised Aluminium Form Holder (Side Hinged)","W - 155mm x L - 260mm x H 20mm","W - 230mm x L - 360mm x H 20mm","W - 230mm x L - 375mm x H 25mm"]
[null,11.967264,17.181072,18.219168]
[]
["Anodised Aluminium Form Holder (Bottom Hinged)","W - 235mm x L - 320mm x H 30mm","W - 160mm x L - 260mm x H 25mm"]
[]
["Anodised Aluminium Form Holder (Bottom Hinged)","W - 235mm x L - 320mm x H 30mm","W - 160mm x L - 260mm x H 25mm"]
[null,"S794","S795"]
[]
["Anodised Aluminium Form Holder (Bottom Hinged)","W - 235mm x L - 320mm x H 30mm","W - 160mm x L - 260mm x H 25mm"]
[null,16.656192000000001,11.967264]
[]
["Anodised Aluminium Card Holder","Vertical","Horizontal"]
[null,"H08","H09"]
[]
["Recipe Card Holder","ST/ST","Aluminium"]
[]
["Recipe Card Holder","ST/ST","Aluminium"]
[null,"P32","P30"]
[]
["Recipe Card Holder","ST/ST","Aluminium"]
[null,10.310976,7.8848640000000003]
[]
["Document Trays","Standard","Large"]
[null,"S240","S091"]
[]
["Document Trays","Standard","Large"]
[null,46.061136000000005,58.868208000000003]
[]
["Stainless Steel File Holders","3 Space File Holder","4 Space File Holder","5 Space File Holder"]
[null,"S253","S254","S255"]
[]
["Stainless Steel File Holders","3 Space File Holder","4 Space File Holder","5 Space File Holder"]
[null,89.766143999999997,107.96198400000002,132.22310400000001]
[]
["Detectable Catering Bins Type","Without Castors/ Wheels","With Castors/ Wheels"]
["Capacity","60 Litre","100 Litre","125 Litre","140 Litre","160 Litre","300 Litre","400 Litre"]
[]
["Detectable Catering Bins Type","Without Castors/ Wheels","With Castors/ Wheels","60 Litre","100 Litre","125 Litre","140 Litre","160 Litre","300 Litre","400 Litre"]
[null,"A131","A130"]
[null,null,null,"S201","S202","S203","S204","S205","S206","S207"]
[]
["Detectable Catering Bins Type","60 Litre","100 Litre","125 Litre","140 Litre","160 Litre","300 Litre","400 Litre"]
["Without Castors/ Wheels",67.382928000000007,79.420176000000012,94.653360000000021,97.73265600000002,106.87723200000001,222.35083200000003,262.62662399999999]
["With Castors/ Wheels",99.890496000000013,112.12603200000001,127.38254400000001,130.45017600000003,139.59475200000003,256.77129600000001,295.33248000000003]
[]
["Detectable Catering Bin Lids","60 Litre ","100 Litre "]
[null,"S244","S245"]
[]
["Detectable Catering Bin Lids","60 Litre ","100 Litre "]
[null,33.557328000000005,33.557328000000005]
[]
["Stainless Steel A Frame Floor Sign","No Print","Sticker Both Sides","Laser Engraved Both Sides","Whiteboard Material Both Sides"]
[null,"T106","T131","T130","T107"]
[]
["Stainless Steel A Frame Floor Sign","No Print","Sticker Both Sides","Laser Engraved Both Sides","Whiteboard Material Both Sides"]
[null,97.2,107.95,190.03,107.95]
[]
["Aluminium Flip Charts","A4 Portrait","A4 Landscape","A3 Landscape","2 Ring Mechansim","4 Ring Mechansim"]
[null,"O06","O05","O04"]
[null,null,null,null,"A35","A36"]
[]
["Aluminium Flip Charts","2 Ring Mechansim","4 Ring Mechansim"]
["A4 Portrait",27.293760000000002,0]
["A4 Landscape",27.293760000000002,28.506816000000004]
["A3 Landscape",0,49.128768000000001]
[]
["Stainless Steel Multi Purpose Dispenser","Dispenser Complete with stand","Wall mounted Dispenser Only","Dispenser Complete with mobile stand"]
[null,"A26","A25","A27"]
[]
["Stainless Steel Multi Purpose Dispenser","Dispenser Complete with stand","Wall mounted Dispenser Only","Dispenser Complete with mobile stand"]
[null,200.15424000000002,97.044480000000007,212.28480000000002]
[]
["Detectable Cable Tidy","16mm diameter","9mm diameter","4mm diameter"]
[null,"S233","S225","S224"]
[]
["Detectable Cable Tidy","16mm diameter","9mm diameter","4mm diameter"]
[null,115.35696000000002,50.948352000000007,33.965568000000005]
[]
["Detect-a-Clamp","Small","Large"]
[null,"S089","S091"]
[]
["Detect-a-Clamp","Small","Large"]
[null,5.8,6.5]
[]
["Detectable Airtight Bowl","Square Bowl","Round Bowl"]
[null,"Z02","Z01"]
[]
["Detectable Airtight Bowl","Square Bowl","Round Bowl"]
[null,11.524032000000002,8.4913920000000012]
[]
["Stackable File Pockets/Holder - A4","Portrait","Landscape"]
[]
["Stackable File Pockets/Holder - A4","Portrait","Landscape","Blue","Black","Red","Green","Yellow","White","Purple","Orange","Pink"]
[null,"O06","O05"]
[null,null,null,"P01","P02","P03","P04","P05","P06","P07","P08","P09"]
[]
["Large Detectable Storage Box ","Blue","Red"]
[null,"P01","P03"]
[]
["Detectable Tote Bin Covers ","Blue","Red","Green","Yellow"]
[null,"P01","P03","P04","P05"]
[]
["Stretch Wrap","200mtr x 400mm x 30micron 2.9kg","800mtr x500mm x 30micron 12.2kg"]
[null,"S221","S228"]
[]
["Stretch Wrap","200mtr x 400mm x 30micron 2.9kg","800mtr x500mm x 30micron 12.2kg"]
[null,109.17504000000001,128.58393599999999]
[]
["Detectable Rubber Bands","Pack of 50","Bulk pack of 600"]
[null,"X09","X13"]
[]
["Detectable Rubber Bands","Pack of 50","Bulk pack of 600"]
[null,4.7355840000000002,53.281152000000006]
[]
["Detectable Rubber Bands","Pack of 50","Bulk pack of 630"]
[null,"X09","X14"]
[]
["Detectable Rubber Bands","Pack of 50","Bulk pack of 630"]
[null,4.6656000000000004,50.341824000000003]
[]
["Detectable Rubber Bands","Pack of 50","Bulk pack of 820"]
[null,"X09","X15"]
[]
["Detectable Rubber Bands","Pack of 50","Bulk pack of 820"]
[null,4.6072800000000003,59.439744000000005]
[]
[]
["Steri - 99.9 Wipes","Suit disinfectant wipes","Suit probe wipes","Blue","Red","Green","Yellow"]
[null,"S091","S089"]
[null,null,null,"P01","P03","P04","P05"]
[]
["Steri - 99.9 Wipes","Suit disinfectant wipes","Suit probe wipes"]
[null,2.7760320000000003,2.309472]
[]
["Steri - 99.9 Wipes","Disinfectant wipes refill","Probe wipes refill","Blue","Red","Green","Yellow"]
[null,"T280","T283"]
[null,null,null,"P01","P03","P04","P05"]
[]
["Steri - 99.9 Wipes","Disinfectant wipes refill","Probe wipes refill"]
[null,5.7503520000000004,4.070736000000001]
[]
["Steri - 99.9 Wipes Refill Pack","Alcohol free disinfectant wipes","Alcohol free probe wipes"]
[null,"T212","T213"]
[]
["Steri - 99.9 Wipes Refill Pack","Alcohol free disinfectant wipes","Alcohol free probe wipes"]
[null,2.9743200000000001,1.7612640000000002]
[]
["Steri - 99.9 Wipe Holder","Metal Detectable","Stainless Steel","Single disinfectant wipe holder","Single probe wipe holder","Dual disinfectant/probe wipe holder"]
[null,"P01","P45"]
[null,null,null,"X36","X37","X38"]
[]
["Steri - 99.9 Wipe Holder","Single disinfectant wipe holder","Single probe wipe holder","Dual disinfectant/probe wipe holder"]
["Metal Detectable",15.163200000000002,10.905840000000001,15.758064000000001]
["Stainless Steel",19.572192000000005,19.887120000000003,31.026240000000005]
[]
["Ultra Hygienic Squeegee ","Blade only","Fully detectable long handle only  - 1435mm (56 1/2\")","St/St Long handle only - 1435mm (56 1/2\")","Blade complete with fully detectable long handle","Blade complete with St/St long handle"]
[null,"A29","A43","A48","A203","A204"]
[]
["Ultra Hygienic Squeegee ","Blade only","Fully detectable long handle only  - 1435mm (56 1/2\")","St/St Long handle only - 1435mm (56 1/2\")","Blade complete with fully detectable long handle","Blade complete with St/St long handle"]
[null,20.925216000000002,34.408800000000006,23.479632000000002,55.34,44.41]
[]
["Dustpan","Blue","Red"]
[null,"P01","P03"]
[]
["Brushes & Brooms  - soft","Nail Brush - 115 x 43 x 46mm  \n (4.5 x 1.7 x 1.8\")","Dish Brush - 235 x 40 x 50mm\n ( 9.25 x 1.57 x 1.97\")","Small Push Broom - 280 x 60 x 70mm \n(11 x 2.36 x 2.75\")","Large Push Broom - 480 x 80 x 130mm \n(18.9 x  3.15 x 5.12\")","Large Cylinder - 350mm (13.78\")","Long Handled Bannister Brush - 370 x 40mm \n(14.7 x 1.56\")"]
[null,"T111","T112","T113","T114","T117","T124"]
[]
["Brushes & Brooms ","Nail Brush - 115 x 43 x 46mm  \n (4.5 x 1.7 x 1.8\")","Dish Brush - 235 x 40 x 50mm\n ( 9.25 x 1.57 x 1.97\")","Small Push Broom - 280 x 60 x 70mm \n(11 x 2.36 x 2.75\")","Large Push Broom - 480 x 80 x 130mm \n(18.9 x  3.15 x 5.12\")","Large Cylinder - 350mm (13.78\")","Long Handled Bannister Brush - 370 x 40mm \n(14.7 x 1.56\")"]
[null,6.4268640000000001,7.2783360000000012,44.276544000000008,62.962271999999999,9.0979200000000002,15.10488]
[]
["Brushes & Brooms  - medium","Dish Brush - 235 x 40 x 50mm\n ( 9.25 x 1.57 x 1.97\")","Small Push Broom - 280 x 60 x 70mm \n(11 x 2.36 x 2.75\")","Large Push Broom - 480 x 80 x 130mm \n(18.9 x  3.15 x 5.12\")","Large Floor Brush - 460 x 65 x 90mm\n (18.11 x 2.56 x 3.54\")","Small Floor Brush - 280 x 60 x 70mm\n (11 x 2.36 x 2.75\")","Large Cylinder - 350mm (13.78\")","Long Handled Bannister Brush - 370 x 40mm \n(14.7 x 1.56\")"]
[null,"T112","T113","T114","T115","T116","T117","T124"]
[]
["Brushes & Brooms ","Dish Brush - 235 x 40 x 50mm\n ( 9.25 x 1.57 x 1.97\")","Small Push Broom - 280 x 60 x 70mm \n(11 x 2.36 x 2.75\")","Large Push Broom - 480 x 80 x 130mm \n(18.9 x  3.15 x 5.12\")","Large Floor Brush - 460 x 65 x 90mm\n (18.11 x 2.56 x 3.54\")","Small Floor Brush - 280 x 60 x 70mm\n (11 x 2.36 x 2.75\")","Large Cylinder - 350mm (13.78\")","Long Handled Bannister Brush - 370 x 40mm \n(14.7 x 1.56\")"]
[null,7.2783360000000012,44.276544000000008,62.962271999999999,46.096128000000007,32.752512000000003,9.0979200000000002,15.10488]
[]
["Brushes & Brooms - Resin Set","Medium flat sweeping broom - 300 x 75mm\n (11.8 x 3\")","Stiff long handled brush - 406 x 50mm\n(16 x 2\")","Soft hand brush - 317 x 36mm\n(12.5 x 1.4\")","Stiff short handled brush - 254 x 72mm \n(10 x 2.8\")","Stiff nail bursh - 122 x 44mm \n(4.8 x 1.7\")"]
[null,"T118","T119","T120","T121","T122"]
[]
["Brushes & Brooms - Resin Set","Medium flat sweeping broom - 300 x 75mm\n (11.8 x 3\")","Stiff long handled brush - 406 x 50mm\n(16 x 2\")","Soft hand brush - 317 x 36mm\n(12.5 x 1.4\")","Stiff short handled brush - 254 x 72mm \n(10 x 2.8\")","Stiff nail bursh - 122 x 44mm \n(4.8 x 1.7\")"]
[null,50.341824000000003,28.751760000000001,20.260368000000003,21.590064000000005,13.950144000000002]
[]
["SK106","Blue","Red","Green","Yellow"]
[null,"P01","P03","P04","P05"]
[]
["SK108","MH Fish Without Hook","MT c/w Hook","M Fish c/w hook & cover","Blue","Red","Green","Yellow"]
[null,"T192","T193","T194"]
[null,null,null,null,"P01","P03","P04","P05"]
[]
["SK108","MH Fish Without Hook","MT c/w Hook","M Fish c/w hook & cover"]
[null,18.399999999999999,19.245600000000003,19.245600000000003]
[]
["SK109","Fish c/w hook & cover","Fish no hook","Fish c/w tape cutter"]
[null,"T195","T192","T193"]
[]
["SK109","Fish c/w hook & cover","Fish no hook","Fish c/w tape cutter"]
[null,25.60248,24.1,25.60248]
[]
["SK118","Shark Knife , With Retracting Hook"]
[null,"T197"]
[]
["SK118","Shark Knife , With Retracting Hook"]
[null,12.795408000000002]
[]
["Safety Knife Holster","Suits SK100/101","Suits SK102"]
[null,"T070","T073"]
[]
["Safety Knife Holster","Suits SK100/101","Suits SK102"]
[null,7.1150400000000005,4.4439840000000004]
[]
["Safety Knife Storage","Blade Bin","Safe Box"]
[null,"T078","T079"]
[]
["Safety Knife Storage","Blade Bin","Safe Box"]
[null,12.118896000000001,7.1150400000000005]
[]
["Replacement Blades "]
["ST/ST Straight Blade","Suits SK109","Suits SK111","Suits SK112","Suits SK118"]
[null,"T075","T076","T077","T387"]
[]
["ST/ST Straight Blade","Suits SK109","Suits SK111","Suits SK112","Suits SK118"]
[null,4.1990400000000001,2.7,2.7,5.7]
[]
["ST/ST Industrial Cutter Blade","Suits SK100","Suits SK101"]
[null,"T071","T072"]
[]
["ST/ST Trapezoid Blade","Suits SK119","Suits SK102","Suits SK105"]
[null,"T036","T073","T074"]
[]
["Pocket Knife","Standard","Fitted with shackle","Fitted with shackle and wrist lanyard"]
[null,"T220","T221","T222"]
[]
["Pocket Knife","Standard","Fitted with shackle","Fitted with shackle and wrist lanyard"]
[null,13.588560000000001,14.801616000000001,16.014672000000001]
[]
["Pocket Knife","Standard","Fitted with shackle","Fitted with shackle and wrist lanyard"]
[null,"T223","T224","T225"]
[]
["Pocket Knife","Standard","Fitted with shackle","Fitted with shackle and wrist lanyard"]
[null,13.588560000000001,14.801616000000001,16.014672000000001]
[]
["Pocket Knife  ","Lambfoot Blade","Sheepfoot Blade","Clip point - general purpose","Pruning blade"]
[null,"T042","T043","T044","T045"]
[]
["Keyhole Tags","50 x 279mm ( 1.97 x 11\")","25 x 190mm (1 x 7.5\")","Blue","Red","Green","Yellow","White","Brown","Purple","Orange","Pink","Beige"]
[null,"S128","S119"]
[null,null,null,"P01","P03","P04","P05","P06","P10","P07","P08","P09","P18"]
[]
["Keyhole Tags","50 x 279mm ( 1.97 x 11\")","25 x 190mm (1 x 7.5\")"]
[null,31.5,28.5]
[]
["Keyhole Tag Dispenser","Suit small keyhole tags","Suit large keyhole tags"]
[null,"S177","S176"]
[]
["Keyhole Tag Dispenser","Suit small keyhole tags","Suit large keyhole tags"]
[null,62.833968000000006,64.291967999999997]
[]
["Keyhole Tag Dispenser","Suit small keyhole tags","Suit large keyhole tags"]
[null,"S179","S178"]
[]
["Keyhole Tag Dispenser","Suit small keyhole tags","Suit large keyhole tags"]
[null,93.848544000000004,96.274656000000022]
[]
["High Heat Keyhole Tags","Blue","Yellow"]
[null,"P01","P05"]
[]
["ID Tags","Blue","Black","Red","Green","Yellow","White","Purple","Orange","Pink"]
[null,"P01","P02","P03","P04","P05","P06","P07","P08","P09"]
[]
["Plastic ID Tags ","Undrilled","Drilled","Drilled with split ring"]
[null,"S435","S436","S437"]
[]
["Plastic ID Tags ","Undrilled","Drilled","Drilled with split ring"]
[null,13.9,14.9,17.399999999999999]
[]
["Plastic ID Tags ","Undrilled","Drilled","Drilled with split ring"]
[null,"S438","S439","S440"]
[]
["Plastic ID Tags ","Undrilled","Drilled","Drilled with split ring"]
[null,19.2,20.399999999999999,23]
[]
["Storage Trays","Stackable","Non Stackable - Large","Blue","Red","Green","Yellow"]
[null,"T162","T163"]
[null,null,null,"P01","P03","P04","P05"]
[]
["Storage Trays","Stackable","Non Stackable - Large"]
[null,13.343616000000001,16.621200000000002]
[]
["Stainless Steel Document Holder","A3","A4"]
[null,"S03","S04"]
[]
["Stainless Steel Document Holder","A3","A4"]
[null,42.398640000000007,30.268080000000001]
[]
["Marker Pen and Eraser Holder","Without Clip","With ST/ST Clip"]
[null,"A02","A10"]
[]
["Marker Pen and Eraser Holder","Without Clip","With ST/ST Clip"]
[null,8.4913920000000012,12.130560000000001]
[]
["Pen Springs","1-499pcs","501-999pcs","1000-2999pcs","3000-4999pcs","5000+ pcs"]
[null,0.26827200000000001,0.17496,0.128304,0.11664000000000002,0.104976]
[]
["Lanyards","Blue","Black","Red","Green","Yellow","White","Purple","Orange","Pink","Hi Vis Yellow","Hi Vis Orange"]
[null,"P01","P02","P03","P04","P05","P06","P07","P08","P09","P63","P62"]
[]
["Large Paper Clip","Blue","Black","Red","Green","Yellow","White","Purple","Orange","Pink"]
[null,"P01","P02","P03","P04","P05","P06","P07","P08","P09"]
[]
["Detectamate - Screw/ nail holder ","Small","Medium","Large"]
[null,"S089","S090","S091"]
[]
["Detectamate - Screw/ nail holder ","Small","Medium","Large"]
[null,11,13,15]
[null,null,null,null,null,null,1.08]
["Hammer/Mallet","25mm diameter head","50mm diameter head","76mm diameter head"]
[null,"S056","S062","S066"]
[]
["Hammer/Mallet","25mm diameter head","50mm diameter head","76mm diameter head"]
[null,30.16,24.25,33.18]
[]
["Detectasil","Blue","White"]
[null,"P01","P06"]
[]
["Cable Ties - with st/st lock","Blue Nylon","Blue Polypropylene","L - 92mm x W - 2.4mm","L - 186mm x W - 4.8mm","L - 340mm x W - 7.0mm","L - 360mm x W - 4.8mm"]
[null,"CT01","CT08"]
[null,null,null,"S139","S117","S122","S123"]
[]
["Cable Ties - with st/st lock","L - 92mm x W - 2.4mm","L - 186mm x W - 4.8mm","L - 340mm x W - 7.0mm","L - 360mm x W - 4.8mm"]
["Blue Nylon",5.4,11.88,34.56,16.200000000000003]
["Blue Polypropylene",9.6999999999999993,15.1,53,27]
[]
["Cable Ties - Blue Nylon","L - 92mm x W - 2.4mm","L - 145mm x W - 3.4mm","L - 150mm x W - 3.5mm","L - 185mm x W - 4.6mm","L -200mm x W - 4.6mm","L - 380mm x W - 4.7mm","L - 390mm x W - 7.6mm"]
[null,"S139","S113","S114","S116","S118","S125","S126"]
[]
["Cable Ties - Blue Nylon","L - 92mm x W - 2.4mm","L - 145mm x W - 3.4mm","L - 150mm x W - 3.5mm","L - 185mm x W - 4.6mm","L -200mm x W - 4.6mm","L - 380mm x W - 4.7mm","L - 390mm x W - 7.6mm"]
[null,4,5,7,10,11,12,24]
[]
["Hairnets - Close Mesh 5mm","Blue","Red","Green","Brown","White"]
[null,"P01","P03","P04","P10","P06"]
[]
["Hairnets - Close Mesh 5mm","Blue","Red","Green","Brown","White"]
[null,11,14,14,14,11]
[]
["Hairnets - Coarse Mesh 10mm","Blue","Brown","White"]
[null,"P01","P10","P06"]
[]
["Hairnets - Coarse Mesh 10mm","Blue","Brown","White"]
[null,10,13,10]
[]
["Hairnets - Extra Close Mesh 3mm","Blue","White"]
[null,"P01","P06"]
[]
["Mob Caps","Blue","Red","White"]
[null,"P01","P03","P06"]
[]
["Mob Caps","Blue","Red","Green","Yellow","White"]
[null,"P01","P03","P04","P05","P06"]
[]
["Mob Caps","Blue","Red","Green","Yellow","White"]
[null,43.2,54,43.2,54,54]
[]
["Balaclava Hood","Blue","Red","White"]
[null,"P01","P03","P06"]
[]
["Beard Snoods","Blue","Red","White"]
[null,"P01","P03","P06"]
[]
["Disposable Vinyl Gloves","Small","Medium","Large","Extra large"]
[null,"S089","S090","S091","S092"]
[]
["Nitrile Gloves",7,8,9,10,11]
[null,"S106","S107","S108","S109","S110"]
[]
["Nitrile Gloves","Hand Covered","Up to elbow length","Up to shoulder length",8,9,10]
[null,"A100","A159","A160"]
[null,null,null,null,"S107","S108","S109"]
[]
["Nitrile Gloves","Hand Covered","Up to elbow length","Up to shoulder length"]
[null,4.6547999999999998,7.8192000000000004,12.009600000000001]
[]
["Disposable Aprons","Blue","Red"]
[null,"P01","P03"]
[]
["Sleeve Covers","Blue","Red","White"]
[null,"P01","P03","P06"]
[]
["Vinyl Glove Dispenser Box ","1 Box Capacity","2 Box Capacity","3 Box Capacity","4 Box Capacity","With intergrated hanging hook","Enclosed Dispenser","Blue","Black","Red","Green","Yellow","White","Purple","Orange","Pink"]
[null,"A151","A152","A153","A154","A155","A156"]
[null,null,null,null,null,null,null,"P01","P02","P03","P04","P05","P06","P07","P08","P09"]
[]
["Vinyl Glove Dispenser Box ","1 Box Capacity","2 Box Capacity","3 Box Capacity","4 Box Capacity","With intergrated hanging hook","Enclosed Dispenser"]
[null,9.6660000000000004,10.746,20.411999999999999,21.492000000000001,10.746,9.6660000000000004]
[]
["Vinyl Glove Dispenser Box st/st","1 box capacity -  horizontal","1 box capacity -  vertical"]
[null,"A157","A158"]
[]
["Vinyl Glove Dispenser Box st/st","1 box capacity -  horizontal","1 box capacity -  vertical"]
[null,20.8872,23.608800000000002]
[]
["Vinyl Glove Dispenser Box st/st","4 box capacity -  horizontal","4 box capacity -  vertical"]
[null,"A157","A158"]
[]
["Vinyl Glove Dispenser Box st/st","4 box capacity -  horizontal","4 box capacity -  vertical"]
[null,77.0364,66.6036]
[]
["Sampling Cutlery","Fork","Spoon","Knife"]
[null,529,527,532]
[]
["Earplug Storage Box ","Blue","Red","Green","Yellow","White"]
[null,"P01","P03","P04","P05","P06"]
[]
["Earplugs ","blue cord with 2 blue plugs","blue cord with 1 blue plug \n& 1 red plug","red cord with 2 red plugs","red cord with 1 red plug & 1 blue plug","3 Flange","2 Flange"]
[null,"P20","P21","P22","P23"]
[null,null,null,null,null,"S102","S101"]
[]
["Earplugs ","3 Flange","2 Flange"]
[null,190,134]
[]
[]
[]
[]
["Earplugs - Plugs only","3 Flange","2 Flange","Blue","Red"]
[null,"S102","S101"]
[null,null,null,"P01","P03"]
[]
["Earplugs - Plugs only","3 Flange","2 Flange"]
[null,91,80]
[]
["Glove Guard","Grip each end","Grip + belt clip"]
[null,"A95","A96"]
[]
["Glove Guard","Grip each end","Grip + belt clip"]
[null,48.3,59.5]
[]
["Plasters","40 x 40 mm (100 pcs)","60 x 20 mm (100 pcs)","70 x 20 mm (100 pcs)","75 x 25 mm (100 pcs)","75 x 50 mm (50 pcs)","60 x 40 mm (50 pcs)","75 x 40 mm (50 pcs)"]
[null,"S127","S131","S133","S136","S138","S132","S137"]
[]
["Plasters","40 x 40 mm (100 pcs)","60 x 20 mm (100 pcs)","70 x 20 mm (100 pcs)","75 x 25 mm (100 pcs)","75 x 50 mm (50 pcs)","60 x 40 mm (50 pcs)","75 x 40 mm (50 pcs)"]
[null,5.67,4.5684000000000005,6.0372000000000003,7.4843999999999999,7.6896000000000004,5.0111999999999997,5.5404]
[]
["Plasters - x-ray","72 x 22 mm","38 x 38 mm","72 x 50 mm"]
[null,"S134","S124","S135"]
[]
["Plasters - x-ray","72 x 22 mm","38 x 38 mm","72 x 50 mm"]
[null,19.018800000000002,17.8416,36.687600000000003]
[]
["Solar powered calculator","Without safety chain","With safety chain"]
[null,"S","C"]
[]
["Solar powered calculator","Without safety chain","With safety chain"]
[null,18.48,20.48]
[]
["Buckets Type","Buckets","Bucket Lids","7 Litre","10 Litre","12 Litre","15 Litre"]
[null,571,562]
[null,null,null,"S069","S029","S031","S034"]
[]
["Buckets Type","7 Litre","10 Litre","12 Litre","15 Litre"]
["Buckets",63.201600000000006,76.874400000000009,87.12360000000001,93.960000000000008]
["Bucket Lids",25.542000000000002,26.4816,28.188000000000002,32.464800000000004]
[]
["Buckets - Reinforced Foot","10 Litre","12 Litre","15 Litre"]
[null,"S029","S031","S034"]
[]
["Buckets - Reinforced Foot","10 Litre","12 Litre","15 Litre"]
[null,109.32840000000002,117.8712,124.6968]
[]
["Buckets - without lid","10 Litre","12 Litre","15 Litre","20 Litre"]
[null,"S029","S031","S034","S039"]
[]
["Buckets - without lid","10 Litre","12 Litre","15 Litre","20 Litre"]
[null,204.99480000000003,232.7724,281.85840000000002,339.95159999999998]
[]
["Multi Purpose Containers ","20 Litre","25 Litre","30 Litre"]
[null,"S039","S040","S041"]
[]
["Multi Purpose Containers ","20 Litre","25 Litre","30 Litre"]
[null,333.10440000000006,409.97880000000004,444.15000000000003]
[]
["Multi Purpose Containers ","50 Litre","75 Litre","100 Litre","150 Litre"]
[null,"S042","S043","S044","S045"]
[]
["Multi Purpose Containers ","50 Litre","75 Litre","100 Litre","150 Litre"]
[null,546.64200000000005,681.58800000000008,819.95760000000007,1194.0588]
[]
["Multi Purpose Containers Lids","20 Litre","25 Litre","30 Litre","50 Litre","75 Litre","100 Litre","150 Litre"]
[null,"S039","S040","S041","S042","S043","S044","S045"]
[]
["Multi Purpose Containers Lids","20 Litre","25 Litre","30 Litre","50 Litre","75 Litre","100 Litre","150 Litre"]
[null,68.331600000000009,90.525599999999997,101.32559999999999,100.7856,102.49200000000002,147.05280000000002,193.10400000000001]
[]
["Castors","25 & 30 Litre","50 Litre","75 Litre","100 Litre","150 Litre"]
[null,"S040","S042","S043","S044","S045"]
[]
["Castors","25 & 30 Litre","50 Litre","75 Litre","100 Litre","150 Litre"]
[null,178.25400000000002,185.68440000000001,200.53440000000003,282.2364,356.50800000000004]
[]
["Measuring Jugs","0.1 Litre","0.25 Litre","0.5 Litre","1.0 Litre","2.0 Litre"]
[null,"S001","S003","S006","S012","S018"]
[]
["Measuring Jugs","0.1 Litre","0.25 Litre","0.5 Litre","1.0 Litre","2.0 Litre"]
[null,4.4603999999999999,5.94,10.767600000000002,14.256,27.486000000000001]
[]
["Measuring Jugs","0.5 Litre","1.0 Litre","1.5 Litre","2.0 Litre"]
[null,"S006","S012","S015","S018"]
[]
["Measuring Jugs","0.5 Litre","1.0 Litre","1.5 Litre","2.0 Litre"]
[null,12.398400000000001,16.794,28.1448,31.946400000000001]
[]
["Measuring Jugs - Straight sided ","0.5 Litre","1.0 Litre","1.5 Litre","2.0 Litre"]
[null,"S006","S012","S015","S018"]
[]
["Measuring Jugs - Straight sided ","0.5 Litre","1.0 Litre","1.5 Litre","2.0 Litre"]
[null,28.738800000000001,36.104400000000005,49.0212,126.2628]
[]
["Measuring Jugs - Straight sided ","0.7 Litre","1.3 Litre","2.1 Litre","3.2 Litre","4.0 Litre","5.0 Litre"]
[null,"S008","S013","S019","S022","S023","S024"]
[]
["Measuring Jugs - Straight sided ","0.7 Litre","1.3 Litre","2.1 Litre","3.2 Litre","4.0 Litre","5.0 Litre"]
[null,34.095600000000005,43.74,56.386800000000008,72.046800000000005,95.061599999999999,112.90320000000001]
[]
["Measuring Jugs - Straight sided ","0.3 Litre","0.6 Litre","1.0 Litre","1.5 Litre","2.0 Litre","3.0 Litre","5.0 Litre"]
[null,"S008","S013","S019","S022","S023","S021","S024"]
[]
["Measuring Jugs - Straight sided ","0.3 Litre","0.6 Litre","1.0 Litre","1.5 Litre","2.0 Litre","3.0 Litre","5.0 Litre"]
[null,19.159199999999998,32.680800000000005,43.070400000000006,50.500799999999998,58.687200000000004,66.841200000000001,72.781199999999998]
[]
["Churns","1 Litre","2 Litre","3 Litre","5 Litre"]
[null,"S012","S018","S021","S024"]
[]
["Churns","1 Litre","2 Litre","3 Litre","5 Litre"]
[null,53.481600000000007,66.841200000000001,93.582000000000008,133.69320000000002]
[]
["Churns","10 Litre","15 Litre","20 Litre"," "]
[null,"S029","S034","S039"]
[]
["Churns","10 Litre","15 Litre","20 Litre"]
[null,438.19920000000002,534.75120000000004,549.61199999999997]
[]
["Churns","5 Litre","10 Litre","20 Litre"]
[null,"S024","S029","S039"]
[]
["Churns","5 Litre","10 Litre","20 Litre"]
[null,393.31440000000003,549.61199999999997,727.8660000000001]
[]
["Funnels- Heavy Gauge","45mm dia","90mm dia","110mm dia","140mm dia","190mm dia","230mm dia","290mm dia"]
[null,"S410","S411","S412","S413","S414","S415","S416"]
[]
["Funnels- Heavy Gauge","45mm dia","90mm dia","110mm dia","140mm dia","190mm dia","230mm dia","290mm dia"]
[null,12.3444,18.943200000000001,20.055600000000002,24.991200000000003,28.738800000000001,37.141200000000005,64.616399999999999]
[]
["Funnels- With hanging hoop","300mm dia","400mm dia"]
[null,"S417","S418",null,null,null,1.1664000000000001]
[]
["Funnels- With hanging hoop","300mm dia","400mm dia"]
[null,99.52200000000002,147.05280000000002]
[]
["Bowls","0.5 Litre","0.75 Litre","1.0 Litre","1.5 Litre","2.0 Litre","3.0 Litre","4.0 Litre","5.0 Litre","6.0 Litre","8.0 Litre","9.0 Litre","11.0 Litre","14.0 Litre"]
[null,"S006","S009","S012","S015","S018","S021","S023","S024","S025","S027","S028","S030","S033"]
[]
["Bowls","0.5 Litre","0.75 Litre","1.0 Litre","1.5 Litre","2.0 Litre","3.0 Litre","4.0 Litre","5.0 Litre","6.0 Litre","8.0 Litre","9.0 Litre","11.0 Litre","14.0 Litre"]
[null,8.9579520000000006,11.337408000000002,11.535696000000002,15.069888000000001,15.069888000000001,20.563632000000002,23.526288000000005,29.160000000000004,30.443040000000003,39.319344000000001,45.956160000000004,52.592976000000007,56.278800000000004]
[]
["Bailing Bowls","1.5 ltr x 180mm dia","2.0 ltr x 200mm dia","3.5 ltr x 240mm dia"]
[null,"S192","S195","S198"]
[]
["Bailing Bowls","1.5 ltr x 180mm dia","2.0 ltr x 200mm dia","3.5 ltr x 240mm dia"]
[null,24.727680000000003,35.703504000000002,45.664560000000002]
[]
["Flour scoop flat handle","0.1 Litre","0.4 Litre","0.85 Litre","1.45 Litre","2.3 Litre"]
[null,"S001","S005","S011","S014","S020"]
[]
["Flour scoop flat handle","0.1 Litre","0.4 Litre","0.85 Litre","1.45 Litre","2.3 Litre"]
[null,18.452448,20.773584,24.867648000000003,27.188784000000002,40.112496000000007]
[]
["Flour scoop hollow handle","0.8 Litre","1.3 Litre","1.8 Litre","2.1 Litre"]
[null,"S010","S013","S017","S019"]
[]
["Flour scoop hollow handle","0.8 Litre","1.3 Litre","1.8 Litre","2.1 Litre"]
[null,28.156896000000003,36.088416000000002,43.308432000000003,50.540112000000001]
[]
["Scrapers - Plastic/ Metal","38mm Blade (1.5\")","50mm Blade (2\")","76mm Blade (3\")"]
[null,"S421","S422","S423"]
[]
["Scrapers - Plastic/ Metal","38mm Blade (1.5\")","50mm Blade (2\")","76mm Blade (3\")"]
[null,13.705200000000001,15.828048000000003,17.939232000000004]
[]
["Scrapers - Plastic/ Metal","38mm Blade (1.5\")","50mm Blade (2\")","76mm Blade (3\")"]
[null,17.939232000000004,20.038752000000002,21.111840000000004]
[]
["Scrapers - Plastic/ Metal","38mm Blade (1.5\")","50mm Blade (2\")","76mm Blade (3\")"]
[null,17.682624000000001,17.880912000000002,18.0792]
[]
["Scrapers - Plastic/ Metal","38mm Blade (1.5\")","50mm Blade (2\")","76mm Blade (3\")"]
[null,18.067536,19.187280000000001,20.365344000000004]
[]
["Scrapers - Plastic/ Metal","38mm Blade (1.5\")","50mm Blade (2\")","76mm Blade (3\")"]
[null,15.769728000000001,15.97968,16.177968]
[]
["Stainless Steel Scraper","20mm (0.8\") wide blade","16mm (0.63\") wide blade","12mm (0.47\") wide blade"]
[null,"S235","S234","S233"]
[]
["Stainless Steel Scraper","20mm (0.8\") wide blade","16mm (0.63\") wide blade","12mm (0.47\") wide blade"]
[null,13.891824000000002,13.343616000000001,13.226976000000001]
[]
["Economy Detectable Bucket ","Blue","Red","Green","Yellow","Purple"]
[null,"A42","A200","A201","A202","A207"]
[]
["Scissors / Knife Holder","Blue","Black","Red","Green","Yellow","White","Purple","Orange","Pink"]
[null,"P01","P02","P03","P04","P05","P06","P07","P08","P09"]
[]
["Swipe Card Holders","Without chain","Complete with chain","Blue","Black","Red","Green","Yellow","White","Purple","Orange","Pink"]
[null,"A56","A55"]
[null,null,null,"P01","P02","P03","P04","P05","P06","P07","P08","P09"]
[]
["Swipe Card Holders","Without chain","Complete with chain"]
[null,4.5,38]
[]
[null,"A3 Portrait","A3 Landscape","A4 Portrait","A4 Landscape","A5 Portrait","A5 Landscape","Blue","Black","Red","Green","Yellow","White","Purple","Orange","Pink","HD St/St Clip","Economy St/St Clip","Economy Chrome Plated","Zinc Clip & Pen Holder","Jumbo Clip","Blue HD St/St Clip","Red HD St/St Clip","Green HD St/St Clip","Yellow HD St/St Clip","Blue Econ Chrome Clip","Red Econ Chrome Clip","Green Econ Chrome Clip","Yellow Econ Chrome Clip"]
["Clipboard Type"]
["Size/Orientation","O07","O04","O06","O05","O08","O21"]
["Colour/Material",null,null,null,null,null,null,"P01","P02","P03","P04","P05","P06","P07","P08","P09"]
["Attachment",null,null,null,null,null,null,null,null,null,null,null,null,null,null,null,"A10","A11","A12","A13","A94","A15","A16","A19","A24","A124","A128","A132","A133"]
[]
["Clipboard Type","HD St/St Clip","Economy St/St Clip","Economy Chrome Plated","Zinc Clip & Pen Holder","Jumbo Clip","Blue HD St/St Clip","Red HD St/St Clip","Green HD St/St Clip","Yellow HD St/St Clip","Blue Econ Chrome Clip","Red Econ Chrome Clip","Green Econ Chrome Clip","Yellow Econ Chrome Clip"]
["A3 Landscape",20.015424000000003,17.589312000000003,16.866144000000002,18.0792,0,11.465712000000002,11.465712000000002,11.465712000000002,11.465712000000002,0,0,0,0]
["A4 Landscape",13.716864000000001,11.768976,10.975824000000001,12.188880000000001,0,9.7744320000000009,9.7744320000000009,9.7744320000000009,9.7744320000000009,8.0364959999999996,8.0364959999999996,8.0364959999999996,8.0364959999999996]
["A5 Landscape",13.833504000000001,11.885616000000001,9.517824000000001,8.9812800000000017,0,8.7013440000000006,8.7013440000000006,8.7013440000000006,8.7013440000000006,0,0,0,0]
["A3 Portrait",12.737088000000002,10.310976,9.5878080000000008,10.800864000000001,0,11.465712000000002,11.465712000000002,11.465712000000002,11.465712000000002,0,0,0,0]
["A4 Portrait",13.716864000000001,11.768976,10.975824000000001,12.188880000000001,0,9.7744320000000009,9.7744320000000009,9.7744320000000009,9.7744320000000009,8.0364959999999996,8.0364959999999996,8.0364959999999996,8.0364959999999996]
["A5 Portrait",11.86,10.19,8.16,7.7,null,7.46,7.46,7.46,7.46]
[]
[]
["Whiteboard Film","3000 x 1000mm roll","1200 x 1000mm roll"]
[null,"S121","S112"]
[]
["Whiteboard Film","3000 x 1000mm roll","1200 x 1000mm roll"]
[null,65.505024000000006,29.113344000000005]
[]
["Ring Binder Clipboards","Blue","Black","Red","Green","Yellow","White","Purple","Orange","Pink","4 Ring","2 Ring"]
[null,"P01","P02","P03","P04","P05","P06","P07","P08","P09"]
[null,null,null,null,null,null,null,null,null,null,"A139","A138"]
[]
["Ring Binder Clipboards","4 Ring","2 Ring"]
[null,22.698144000000003,22.441535999999999]
[]
["Ring Binder Clipboards","4 Ring","2 Ring"]
[null,25.124256000000003,24.879311999999999]
[]
["Ring Binder Clipboards","4 Ring","2 Ring"]
[null,11.96,11.75]
[]
["Magnetic Ring Binder Clipboards","4 Ring","2 Ring"]
[null,27.76,27.52]
[]
[]
["Shovel","Standard","Reinforced","10.75\" X 15\" Blade","9.5\" X 12.5\" Square Blade","11.5\" X 15.5\" Blade","7\" x 11\" Blade","13.75\" x 17\" Blade"]
[null,670,"670R"]
[null,null,null,"T330","T331","T332","T333","T334"]
[]
["Shovel","10.75\" X 15\" Blade","9.5\" X 12.5\" Square Blade","11.5\" X 15.5\" Blade","7\" x 11\" Blade","13.75\" x 17\" Blade"]
["Standard",120.13920000000002,118.97280000000001,122.47200000000001,120.13920000000002,131.8032]
["Reinforced",129.47040000000001,128.304,132.96960000000001,129.47040000000001,134.13600000000002]
[]
[]
["Shovel","10.75\" X 15\" Blade","9.5\" X 12.5\" Square Blade","11.5\" X 15.5\" Blade","7\" x 11\" Blade"]
[null,"T335","T336","T337","T338"]
[]
["Shovel","10.75\" X 15\" Blade","9.5\" X 12.5\" Square Blade","11.5\" X 15.5\" Blade","7\" x 11\" Blade"]
[null,136.46880000000002,145.80000000000001,132.96960000000001,132.96960000000001]
[]
["Paddle","36\" Long","42\" Long","48\" Long","60\" Long"]
[null,"S063","S064","S065","S066"]
[]
["Paddle","36\" Long","42\" Long","48\" Long","60\" Long"]
[null,82.362000000000009,100.64700000000001,134.52000000000001,145.44]
[]
["Shovel","Standard","Reinforced","Super Reinforced","5 Tines - 12\"Long","5 Tines - 8.5\" Long","4 Tines - 12\"Long","4 Tines - 8.5\" Long"]
[null,"T133","T134","T135"]
[null,null,null,null,"S500","S501","S502","S503"]
[]
["Fork","5 Tines - 12\"Long","5 Tines - 8.5\" Long","4 Tines - 12\"Long","4 Tines - 8.5\" Long"]
["Standard",122.04,122.04,122.04,122.04]
["Reinforced",146.88000000000002,146.88000000000002,146.88000000000002,146.88000000000002]
["Super Reinforced",152.28,152.28,152.28,152.28]
[]
["Paper","A4","USA Letter (8.5\" x 11\")","25 Sheets","50 Sheets","100 Sheets"]
[null,"S04","S514"]
[null,null,null,"X06","X09","X11"]
[]
["Paper","25 Sheets","50 Sheets","100 Sheets"]
["A4",10.26,20.55,40.799999999999997]
["USA Letter (8.5\" x 11\")",10.26,20.55,40.799999999999997]
[]
[]
["Paper Holder","To suit A5 paper","To suit Memo paper - 95 x 95 mm (3.7\" x 3.7\")"]
[null,"S05","S407"]
[]
["Paper Holder","To suit A5 paper","To suit Memo paper - 95 x 95 mm (3.7\" x 3.7\")"]
[null,3.84,1.52]
[]
["Cable Ties","Blue","Red","Green","Yellow","Orange"]
[null,"CT04","CT05","CT06","CT07","CT09"]
[]
["Silicone Rubber Sheet","2000 x 1000 x 1.5 mm (1.8 kg/m)","2000 x 1000 x 2 mm (2.4 kg/m)","2000 x 1000 x 3 mm (3.6kg /m)","2000 x 1000 x 4 mm (4.8kg /m)","2000 x 1000 x 6 mm (7.2 kg/m)"]
[null,"S148","S149","S150","S151","S152"]
[]
["Silicone Rubber Sheet","2000 x 1000 x 1.5 mm (1.8 kg/m)","2000 x 1000 x 2 mm (2.4 kg/m)","2000 x 1000 x 3 mm (3.6kg /m)","2000 x 1000 x 4 mm (4.8kg /m)","2000 x 1000 x 6 mm (7.2 kg/m)"]
[null,224.56440000000003,265.24799999999999,315.60840000000002,410.72400000000005,491.45400000000006]
[]
["Colour Stainless Steel Wall Mounted Document/Clipboard Holder","Blue","Red","Green","Yellow"]
[null,"P01","P03","P04","P05"]
[]
[]
[]
["Highlighter Refills","Blue","Green","Yellow","Orange","Pink"]
[null,"P01","P04","P05","P08","P09"]
[]
["Lock Out Sign","Blue","Black","Red","Green","Yellow","White","Purple","Orange","Pink"]
[null,"P01","P02","P03","P04","P05","P06","P07","P08","P09"]
[]
[]
["Paper Towel Holder","Blue","Black","Red","Green","Yellow","White","Purple","Orange","Pink"]
[null,"P01","P02","P03","P04","P05","P06","P07","P08","P09"]
[]
[]
["Professional Knives","2.5\" (60mm)","3\" (70m)","3.5\" (90mm)","4\" (100mm)","5\" (130mm)","6\" (150mm)","6.25\" (158mm)","6.5\" (165mm)","7\" (180mm)","7.5\" (190mm)","8\" (203mm)","8.5\" (220mm)","9\" (230mm)","10\" (250mm)","11\" (280mm)","12\" (304mm)","Blue","Red","Green","Yellow","White","Brown"]
[null,"S425","S423","S480","S068","S443","S401","S877","S070","S492","S878","S071","S456","S879","S072","S880","S473"]
[null,null,null,null,null,null,null,null,null,null,null,null,null,null,null,null,null,"P01","P03","P04","P05","P06","P10"]
["Wavy  Edge Slicer","8\" (203mm)","10\" (250mm)","12\" (304mm)"]
[null,155,164.5,197]
[]
["Cooks Knife","6.25\" (158mm)","7.5\" (190mm)","8.5\" (220mm)","10\" (250mm)","12\" (304mm)"]
[null,"S877","S878","S456","S072","S473"]
[]
["Cooks Knife","6.25\" (158mm)","7.5\" (190mm)","8.5\" (220mm)","10\" (250mm)","12\" (304mm)"]
[null,216,227,237.5,269,327.5]
[]
["Straight Back Butchers Knife","10\" (250mm)","12\" (304mm)"]
[null,"S072","S473"]
[]
["Straight Back Butchers Knife","10\" (250mm)","12\" (304mm)"]
[null,364,424]
[]
["Scimitar Butchers Knife","6\" (150mm)","7\" (180mm)","8\" (203mm)","9\" (230mm)","10\" (250mm)","11\" (280mm)","12\" (304mm)"]
[null,"S401","S492","S071","S879","S072","S880","S473"]
[]
["Scimitar Butchers Knife","6\" (150mm)","7\" (180mm)","8\" (203mm)","9\" (230mm)","10\" (250mm)","11\" (280mm)","12\" (304mm)"]
[null,200,227,255,284,302,334,363]
[]
["Dagger Point Butchers Knife","10\" (250mm)","12\" (304mm)"]
[null,364,424]
[]
["Curved Scimitar Butchers Knife","10\" (250mm)","12\" (304mm)"]
[null,"S072","S473"]
["Curved Scimitar Butchers Knife","10\" (250mm)","12\" (304mm)"]
[null,364,424]
[]
["Curved Boning Knife","5\" (130mm)","6\" (150mm)"]
[null,"S443","S401"]
[]
["Curved Boning Knife","5\" (130mm)","6\" (150mm)"]
[null,154,159]
[]
["Boning Knife","5\" (130mm)","6\" (150mm)","7\" (180mm)"]
[null,"S443","S401","S492"]
[]
["Boning Knife","5\" (130mm)","6\" (150mm)","7\" (180mm)"]
[null,154,159,176]
[]
["Boning Knife - Narrow","5\" (130mm)","6\" (150mm)"]
[null,"S443","S401"]
[]
["Boning Knife - Narrow","5\" (130mm)","6\" (150mm)"]
[null,154,159]
[]
["Skinning/ Siding Knife","6\" (150mm)","7\" (180mm)"]
[null,"S401","S492"]
[]
["Skinning/ Siding Knife","6\" (150mm)","7\" (180mm)"]
[null,183,200]
[]
["Narrow Scimitar Steak Knife","8\" (203mm)","10\" (250mm)","12\" (304mm)"]
[null,"S071","S072","S473"]
[]
["Narrow Scimitar Steak Knife","8\" (203mm)","10\" (250mm)","12\" (304mm)"]
[null,255,302,363]
[]
["Filleting Knife - Narrow","5\" (130mm)","6\" (150mm)"]
[null,"S443","S401"]
[]
["Filleting Knife - Narrow","5\" (130mm)","6\" (150mm)"]
[null,157.69999999999999,163]
[]
["Light Cooks Knife","3\" (70m)","4\" (100mm)","6\" (150mm)","7\" (180mm)","8\" (203mm)"]
[null,"S423","S068","S401","S492","S071"]
[]
["Light Cooks Knife","3\" (70m)","4\" (100mm)","6\" (150mm)","7\" (180mm)","8\" (203mm)"]
[null,112.3,140.4,171.3,212.3,227.9]
[]
["Broad Cooks Knife","8\" (203mm)","10\" (250mm)"]
[null,"S071","S072"]
[]
["Broad Cooks Knife","8\" (203mm)","10\" (250mm)"]
[null,257,310]
[]
["Vegatable Knife - Serrated","3.5\" (90mm)","4\" (100mm)"]
[null,"S480","S068"]
[]
["Vegatable Knife - Serrated","3.5\" (90mm)","4\" (100mm)"]
[null,74.5,75.599999999999994]
[]
["Vegatable Knife","3.5\" (90mm)","4\" (100mm)"]
[null,"S480","S068"]
[]
["Vegatable Knife","3.5\" (90mm)","4\" (100mm)"]
[null,61.5,63.7]
[]
["Palette Knife - Flexible ","4\" (100mm)","6\" (150mm)","7\" (180mm)","8\" (203mm)","10\" (250mm)","12\" (304mm)"]
[null,"S068","S401","S492","S071","S072","S473"]
[]
["Palette Knife - Flexible ","4\" (100mm)","6\" (150mm)","7\" (180mm)","8\" (203mm)","10\" (250mm)","12\" (304mm)"]
[null,82,88.5,94,136,171.7,217]
[]
["Artist Palette - Flexible","3\" (70m)","4\" (100mm)","6\" (150mm)"]
[null,"S423","S068","S401"]
[]
["Artist Palette - Flexible","3\" (70m)","4\" (100mm)","6\" (150mm)"]
[null,81,88.5,97.2]
[]
["Forged Cooks Knife - No Rivets ","3\" (70m)","7\" (180mm)","10\" (250mm)"]
[null,"S423","S492","S072"]
[]
["Forged Cooks Knife - No Rivets ","3\" (70m)","7\" (180mm)","10\" (250mm)"]
[null,264.60000000000002,337,453.6]
[]
["Forged Cooks Knife - With Rivets ","4\" (100mm)","5\" (130mm)","8\" (203mm)","10\" (250mm)"]
[null,"S068","S443","S071","S072"]
[]
["Forged Cooks Knife - With Rivets ","4\" (100mm)","5\" (130mm)","8\" (203mm)","10\" (250mm)"]
[null,313.2,343,468.7,520]
[]
[]
["Professional Knives","2.5\" (60mm)","3\" (70m)","3.5\" (90mm)","4\" (100mm)","5\" (130mm)","6\" (150mm)","6.25\" (158mm)","6.5\" (165mm)","7\" (180mm)","7.5\" (190mm)","8\" (203mm)","8.5\" (220mm)","9\" (230mm)","10\" (250mm)","11\" (280mm)","12\" (304mm)","Blue","Red","Green","Yellow","White","Brown"]
[null,"S425","S423","S480","S068","S443","S401","S877","S070","S492","S878","S071","S456","S879","S072","S880","S473"]
[null,null,null,null,null,null,null,null,null,null,null,null,null,null,null,null,null,"P01","P03","P04","P05","P06","P10"]
[]
["Cooks Knife","6.25\" (158mm)","7.5\" (190mm)","8.5\" (220mm)","10\" (250mm)","12\" (304mm)"]
[null,"S877","S878","S456","S072","S473"]
[]
["Cooks Knife","6.25\" (158mm)","7.5\" (190mm)","8.5\" (220mm)","10\" (250mm)","12\" (304mm)"]
[null,246.1,258,266.7,300.2,366.1]
[]
["Straight Back Butchers Knife","10\" (250mm)","12\" (304mm)"]
[null,"S072","S473"]
[]
["Straight Back Butchers Knife","10\" (250mm)","12\" (304mm)"]
[null,394.2,448.2]
[]
["Scimitar Butchers Knife","6\" (150mm)","7\" (180mm)","8\" (203mm)","9\" (230mm)","10\" (250mm)","11\" (280mm)","12\" (304mm)"]
[null,"S401","S492","S071","S879","S072","S880","S473"]
[]
["Scimitar Butchers Knife","6\" (150mm)","7\" (180mm)","8\" (203mm)","9\" (230mm)","10\" (250mm)","11\" (280mm)","12\" (304mm)"]
[null,224.5,253.5,284,304.5,331.5,364,384.5]
[]
["Dagger Point Butchers Knife","10\" (250mm)","12\" (304mm)"]
[null,394.2,448.2]
[]
["Curved Scimitar Butchers Knife","10\" (250mm)","12\" (304mm)"]
[null,"S072","S473"]
["Curved Scimitar Butchers Knife","10\" (250mm)","12\" (304mm)"]
[null,394.2,448.2]
[]
["Curved Boning Knife","5\" (130mm)","6\" (150mm)"]
[null,"S443","S401"]
[]
["Curved Boning Knife","5\" (130mm)","6\" (150mm)"]
[null,167.4,177.1]
[]
["Boning Knife","5\" (130mm)","6\" (150mm)","7\" (180mm)"]
[null,"S443","S401","S492"]
[]
["Boning Knife","5\" (130mm)","6\" (150mm)","7\" (180mm)"]
[null,167.4,177.1,197.6]
[]
["Boning Knife - Narrow","5\" (130mm)","6\" (150mm)"]
[null,"S443","S401"]
[]
["Boning Knife - Narrow","5\" (130mm)","6\" (150mm)"]
[null,154,159]
[]
["Narrow Scimitar Steak Knife","8\" (203mm)","10\" (250mm)","12\" (304mm)"]
[null,"S071","S072","S473"]
[]
["Narrow Scimitar Steak Knife","8\" (203mm)","10\" (250mm)","12\" (304mm)"]
[null,284,331.5,386.2]
[]
["Vegatable Knife","3.5\" (90mm)","4\" (100mm)"]
[null,"S480","S068"]
[]
["Vegatable Knife","3.5\" (90mm)","4\" (100mm)"]
[null,79,88]
[]
["Counter Knife","8\" (203mm)","10\" (250mm)"]
[null,"S071","S072"]
[]
["Counter Knife","8\" (203mm)","10\" (250mm)"]
[null,160.9,215]
[]
["Ham / Smoked Salmon Slicer","8\" (203mm)","9\" (230mm)","10\" (250mm)","11\" (280mm)","12\" (304mm)"]
[null,"S071","S879","S072","S880","S473"]
[]
["Ham / Smoked Salmon Slicer","8\" (203mm)","9\" (230mm)","10\" (250mm)","11\" (280mm)","12\" (304mm)"]
[null,173,198.7,225.3,254.7,284]
[]
[]
["Long Handle for Brooms","Fully detectable long handle only  - 1435mm \n(56 1/2\")","Stainless Steel Long handle only - 1435mm \n(56 1/2\")"]
[null,"A43","A48"]
[]
["Long Handle for Brooms","Fully detectable long handle only  - 1435mm \n(56 1/2\")","Stainless Steel Long handle only - 1435mm \n(56 1/2\")"]
[null,34.409999999999997,23.48]
[]
["Handheld Squeegee","With short detectable handle -\n 140mm (5.5\")  ","Blade with fully detectable long handle -1435mm (56 1/2\")","Blade with stainless steel long handle -  1435mm  (56 1/2\")"]
[null,"A28","A210","A211"]
[]
["Handheld Squeegee","With short detectable handle -\n 140mm (5.5\")  ","Blade with fully detectable long handle -1435mm (56 1/2\")","Blade with stainless steel long handle -  1435mm  (56 1/2\")"]
[null,19.399999999999999,53.81,42.88]
[]
["Detectable Health & Safety Signs","A3","A4","A5","Blue","Black","Red","Green","Yellow","White","Purple","Orange","Pink","Detectable Products Area","Wear Hairnets","Wear Face Shields","Wear Safety Boots","Wash Your Hands","Wear High Visibility Jackets","Wear a Mask","Wear Protective clothing","Wear Ear Protectors","Wear Protective Gloves"]
[null,"S03","S04","S05"]
[null,null,null,null,"P01","P02","P03","P04","P05","P06","P07","P08","P09"]
[null,null,null,null,null,null,null,null,null,null,null,null,null,"L01","L02","L03","L04","L05","L06","L07","L08","L09","L10"]
[]
[]
["Detectable Health & Safety Signs","A3","A4","A5"]
[null,17.899999999999999,8.9,5.6]
[]
[]
["Pharma Scoop","8oz","16oz","32oz","50oz","64oz","2\" x 6\" Bowl, 4\" Handle","2.25\" x 7.75\" Bowl, 4\" Handle","2.25\" x 7.75\" Bowl, 24\" Handle","2.25\" x 9\" Bowl, 4\" Handle","2.25\" x 9\" Bowl, 24\" Handle","2.25\" x 9\" Bowl, 9\" Ergo Handle","5.5\" x 12\" Bowl, 4\" Handle","5.5\" x 12\" Bowl, 12\" Ergo Handle","5.5\" x 9\" Bowl, 4\" Handle","6.25\" x 7.5\" Bowl, 4\" Handle","5.5\" x 9\" Bowl, Ergo Handle"]
[null,"S560","S561","S562","S567","S563"]
[null,null,null,null,null,null,"A170","A171","A172","A173","A174","A178","A176","A180","A175","A177","A179"]
[]
[null,"2\" x 6\" Bowl, 4\" Handle","2.25\" x 7.75\" Bowl, 4\" Handle","2.25\" x 7.75\" Bowl, 24\" Handle","2.25\" x 9\" Bowl, 4\" Handle","2.25\" x 9\" Bowl, 24\" Handle","2.25\" x 9\" Bowl, 9\" Ergo Handle","5.5\" x 12\" Bowl, 4\" Handle","5.5\" x 12\" Bowl, 12\" Ergo Handle","5.5\" x 9\" Bowl, 4\" Handle","6.25\" x 7.5\" Bowl, 4\" Handle","5.5\" x 9\" Bowl, Ergo Handle"]
["Pharma Scoop",30,36,38,43,44,49,62,58,44,52,63]
[]
["Stainless Steel Wall Mounted File Holder","Portrait","Landscape"]
[null,"O06","O05"]
[]
["Bowl Scoop","8oz","16oz","32oz","50oz","64oz","96oz","128oz","160oz","2.75\" x 4\" Bowl, 4\" Handle","3.4 \" x 5.12\" Bowl, 4\" Handle","4.25\" x 6.6\" Bowl, 4\" Handle","4.25\" x 6.6\" Bowl, 24\" Handle","5.12\" x 8.25\" Bowl, 4\" Handle","5.12\" x 8.25\" Bowl, 24\" Handle","5.75\" x 9.5\" Bowl, 4.5\" Handle","6.5\" x 9\" Bowl, 4.5\" Handle","6.5\" x 9\" Bowl, 4.5\" Straight Handle","8\" x 10\" Bowl, 5\" Handle"]
[null,"S560","S561","S562","S567","S563","S564","S565","S566"]
[null,null,null,null,null,null,null,null,null,"A110","A111","A112","A113","A114","A115","A116","A119","A129","A134"]
[]
[null,"2.75\" x 4\" Bowl, 4\" Handle","3.4 \" x 5.12\" Bowl, 4\" Handle","4.25\" x 6.6\" Bowl, 4\" Handle","4.25\" x 6.6\" Bowl, 24\" Handle","5.12\" x 8.25\" Bowl, 4\" Handle","5.12\" x 8.25\" Bowl, 24\" Handle","5.75\" x 9.5\" Bowl, 4.5\" Handle","6.5\" x 9\" Bowl, 4.5\" Handle","6.5\" x 9\" Bowl, 4.5\" Straight Handle","8\" x 10\" Bowl, 5\" Handle"]
["Bowl Scoop",35,36,38,44,47,49,48,52,53,59]
[]
[]
["TEST PIECES"]
[]
[]
["Ferrous","0.25mm","0.3mm","0.4mm","0.5mm","0.6mm","0.7mm","0.8mm","0.9mm","1.0mm","1.1mm","1.2mm","1.3mm","1.5mm","1.588mm","1.6mm","1.7mm","1.8mm","2mm","2.2mm","2.3mm","2.381mm","2.4mm","2.5mm","2.7mm","2.8mm","3.0mm","3.175mm","3.18mm","3.2mm","3.5mm","3.8mm","4.0mm","4.5mm","5.0mm","5.5mm","6.0mm","6.35mm","6.5mm","7.0mm","7.5mm","8.0mm","8.5mm","9.0mm","9.525mm","9.5mm","10.0mm","10.5mm","11.0mm","12.0mm","12.7mm","13.0mm","14.0mm","15.0mm","15.875mm","17.0mm","19.05mm","20.0mm"]
[null,"E01","E02","E04","E05","E06","E07","E08","E09","E10","E11","E12","E13","E15","E16","E17","E18","E19","E20","E21","E22","E23","E24","E25","E26","E27","E28","E29","E65","E30","E31","E32","E34","E35","E39","E40","E42","E43","E44","E45","E46","E47","E48","E49","E50","E51","E52","E53","E54","E55","E56","E57","E58","E59","E60","E61","E62","E63"]
[]
["Ferrous","0.25mm","0.3mm","0.4mm","0.5mm","0.6mm","0.7mm","0.8mm","0.9mm","1.0mm","1.1mm","1.2mm","1.3mm","1.5mm","1.588mm","1.6mm","1.7mm","1.8mm","2mm","2.2mm","2.3mm","2.381mm","2.4mm","2.5mm","2.7mm","2.8mm","3.0mm","3.175mm","3.18mm","3.2mm","3.5mm","3.8mm","4.0mm","4.5mm","5.0mm","5.5mm","6.0mm","6.35mm","6.5mm","7.0mm","7.5mm","8.0mm","8.5mm","9.0mm","9.525mm","9.5mm","10.0mm","10.5mm","11.0mm","12.0mm","12.7mm","13.0mm","14.0mm","15.0mm","15.875mm","17.0mm","19.05mm","20.0mm"]
[null,10.5,10.5,10.5,10.5,10.5,10.5,10.5,10.5,10.5,10.5,10.5,10.5,10.5,10.5,10.5,10.5,10.5,10.5,10.5,10.5,10.5,10.5,10.5,10.5,10.5,10.5,10.5,10.5,10.5,10.5,10.5,10.5,10.5,10.5,10.5,10.5,10.5,10.5,10.5,15.5,15.5,15.5,15.5,15.5,15.5,15.5,15.5,15.5,15.5,15.5,15.5,15.5,15.5,28.5,28.5,28.5,28.5]
[]
["Non- Ferrous","0.25mm","0.3mm","0.4mm","0.5mm","0.6mm","0.7mm","0.8mm","0.9mm","1.0mm","1.1mm","1.2mm","1.3mm","1.5mm","1.588mm","1.6mm","1.7mm","1.8mm","2mm","2.2mm","2.3mm","2.381mm","2.4mm","2.5mm","2.7mm","2.8mm","3.0mm","3.175mm","3.18mm","3.2mm","3.5mm","3.8mm","4.0mm","4.5mm","5.0mm","5.5mm","6.0mm","6.35mm","6.5mm","7.0mm","7.5mm","8.0mm","8.5mm","9.0mm","9.525mm","9.5mm","10.0mm","10.5mm","11.0mm","12.0mm","12.7mm","13.0mm","14.0mm","15.0mm","15.875mm","17.0mm","19.05mm","20.0mm"]
[null,"E01","E02","E04","E05","E06","E07","E08","E09","E10","E11","E12","E13","E15","E16","E17","E18","E19","E20","E21","E22","E23","E24","E25","E26","E27","E28","E29","E65","E30","E31","E32","E34","E35","E39","E40","E42","E43","E44","E45","E46","E47","E48","E49","E50","E51","E52","E53","E54","E55","E56","E57","E58","E59","E60","E61","E62","E63"]
[]
["Non- Ferrous","0.25mm","0.3mm","0.4mm","0.5mm","0.6mm","0.7mm","0.8mm","0.9mm","1.0mm","1.1mm","1.2mm","1.3mm","1.5mm","1.588mm","1.6mm","1.7mm","1.8mm","2mm","2.2mm","2.3mm","2.381mm","2.4mm","2.5mm","2.7mm","2.8mm","3.0mm","3.175mm","3.18mm","3.2mm","3.5mm","3.8mm","4.0mm","4.5mm","5.0mm","5.5mm","6.0mm","6.35mm","6.5mm","7.0mm","7.5mm","8.0mm","8.5mm","9.0mm","9.525mm","9.5mm","10.0mm","10.5mm","11.0mm","12.0mm","12.7mm","13.0mm","14.0mm","15.0mm","15.875mm","17.0mm","19.05mm","20.0mm"]
[null,10.5,10.5,10.5,10.5,10.5,10.5,10.5,10.5,10.5,10.5,10.5,10.5,10.5,10.5,10.5,10.5,10.5,10.5,10.5,10.5,10.5,10.5,10.5,10.5,10.5,10.5,10.5,10.5,10.5,10.5,10.5,10.5,10.5,10.5,10.5,10.5,10.5,10.5,10.5,15.5,15.5,15.5,15.5,15.5,15.5,15.5,15.5,15.5,15.5,15.5,15.5,15.5,15.5,28.5,28.5,28.5,28.5]
[]
["Stainless Steel 316","0.3mm","0.4mm","0.5mm","0.6mm","0.7mm","0.8mm","0.9mm","1.0mm","1.1mm","1.2mm","1.3mm","1.5mm","1.6mm","1.8mm","2mm","2.2mm","2.4mm","2.5mm","2.7mm","2.8mm","3.0mm","3.2mm","3.5mm","3.8mm","4.0mm","4.5mm","5.0mm","5.5mm","6.0mm","6.5mm","7.0mm","7.5mm","8.0mm","8.5mm","9.0mm","9.525mm","9.5mm","10.0mm","11.0mm","12.0mm","12.7mm","13.0mm","14.0mm","15.0mm","20.0mm"]
[null,"E02","E04","E05","E06","E07","E08","E09","E10","E11","E12","E13","E15","E17","E19","E20","E21","E24","E25","E26","E27","E28","E30","E31","E32","E34","E35","E39","E40","E42","E44","E45","E46","E47","E48","E49","E50","E51","E52","E54","E55","E56","E57","E58","E59","E63"]
[]
["Stainless Steel 316","0.3mm","0.4mm","0.5mm","0.6mm","0.7mm","0.8mm","0.9mm","1.0mm","1.1mm","1.2mm","1.3mm","1.5mm","1.6mm","1.8mm","2mm","2.2mm","2.4mm","2.5mm","2.7mm","2.8mm","3.0mm","3.2mm","3.5mm","3.8mm","4.0mm","4.5mm","5.0mm","5.5mm","6.0mm","6.5mm","7.0mm","7.5mm","8.0mm","8.5mm","9.0mm","9.525mm","9.5mm","10.0mm","11.0mm","12.0mm","12.7mm","13.0mm","14.0mm","15.0mm","20.0mm"]
[null,10.5,10.5,10.5,10.5,10.5,10.5,10.5,10.5,10.5,10.5,10.5,10.5,10.5,10.5,10.5,10.5,10.5,10.5,10.5,10.5,10.5,10.5,10.5,10.5,10.5,10.5,10.5,10.5,10.5,10.5,10.5,15.5,15.5,15.5,15.5,15.5,15.5,15.5,15.5,15.5,15.5,15.5,15.5,15.5,28.5]
[]
["Stainless Steel 304","0.5mm","0.6mm","0.8mm","1.0mm","1.2mm","1.5mm","1.8mm","2mm","2.5mm","3.0mm","3.5mm","4.0mm","4.5mm","5.0mm","5.5mm","6.0mm","6.5mm","7.0mm","8.0mm","8.5mm","9.0mm","9.5mm","10.0mm","11.0mm","12.0mm","15.0mm"]
[null,"E05","E06","E08","E10","E12","E15","E19","E20","E25","E28","E31","E34","E35","E39","E40","E42","E44","E45","E47","E48","E49","E51","E52","E54","E55","E59"]
[]
["Stainless Steel 304","0.5mm","0.6mm","0.8mm","1.0mm","1.2mm","1.5mm","1.8mm","2mm","2.5mm","3.0mm","3.5mm","4.0mm","4.5mm","5.0mm","5.5mm","6.0mm","6.5mm","7.0mm","8.0mm","8.5mm","9.0mm","9.5mm","10.0mm","11.0mm","12.0mm","15.0mm"]
[null,10.5,10.5,10.5,10.5,10.5,10.5,10.5,10.5,10.5,10.5,10.5,10.5,10.5,10.5,10.5,10.5,10.5,10.5,15.5,15.5,15.5,15.5,15.5,15.5,15.5,15.5]
[]
["Aluminium","0.8mm","1.0mm","1.2mm","1.5mm","1.8mm","2mm","2.5mm","3.0mm","3.5mm","4.0mm","4.5mm","5.0mm","5.5mm","6.0mm","7.0mm","8.0mm"]
[null,"E08","E10","E12","E15","E19","E20","E25","E28","E31","E34","E35","E39","E40","E42","E45","E47"]
[]
["Aluminium","0.8mm","1.0mm","1.2mm","1.5mm","1.8mm","2mm","2.5mm","3.0mm","3.5mm","4.0mm","4.5mm","5.0mm","5.5mm","6.0mm","7.0mm","8.0mm"]
[null,10.5,10.5,10.5,10.5,10.5,10.5,10.5,10.5,10.5,10.5,10.5,10.5,10.5,10.5,10.5,15.5]
[]
["Ph Bronze","1.5mm","1.6mm","2mm","2.5mm","3.0mm","4.0mm"]
[null,"E15","E17","E20","E25","E28","E34"]
[]
["Ph Bronze","1.5mm","1.6mm","2mm","2.5mm","3.0mm","4.0mm"]
[null,10.5,10.5,10.5,10.5,10.5,10.5]
[]
["Soda Lime Glass","1.0mm","2mm","2.5mm","3.0mm","4.0mm","5.0mm","6.0mm","7.0mm","8.0mm","10.0mm","12.0mm","14.0mm"]
[null,"E10","E20","E25","E28","E34","E39","E42","E45","E47","E52","E55","E58"]
[]
["Soda Lime Glass","1.0mm","2mm","2.5mm","3.0mm","4.0mm","5.0mm","6.0mm","7.0mm","8.0mm","10.0mm","12.0mm","14.0mm"]
[null,10.5,10.5,10.5,10.5,10.5,10.5,10.5,10.5,15.5,15.5,15.5,15.5]
[]
["Teflon  (PTFE)","1.5mm","2mm","2.5mm","3.0mm","4.0mm","5.0mm","6.0mm","7.0mm","8.0mm"]
[null,"E15","E20","E25","E28","E34","E39","E42","E45","E47"]
[]
["Teflon  (PTFE)","1.5mm","2mm","2.5mm","3.0mm","4.0mm","5.0mm","6.0mm","7.0mm","8.0mm"]
[null,10.5,10.5,10.5,10.5,10.5,10.5,10.5,10.5,15.5]
[]
["Crystal Glass","2mm","3.0mm","4.0mm","5.0mm","6.0mm","8.0mm"]
[null,"E20","E28","E34","E39","E42","E47"]
[]
["Crystal Glass","2mm","3.0mm","4.0mm","5.0mm","6.0mm","8.0mm"]
[null,10.5,10.5,10.5,10.5,10.5,15.5]
[]
[]
["Ceramic","1.0mm","2mm","2.5mm","3.0mm","3.5mm","4.0mm","5.0mm","6.0mm","7.0mm","7.5mm","8.0mm","8.0mm","8.5mm","9.0mm","10.0mm","12.0mm"]
[null,"E10","E20","E25","E28","E31","E34","E39","E42","E45","E46","E47","E47","E48","E49","E52","E55"]
[]
["Ceramic","1.0mm","2mm","2.5mm","3.0mm","3.5mm","4.0mm","5.0mm","6.0mm","7.0mm","7.5mm","8.0mm","8.0mm","8.5mm","9.0mm","10.0mm","12.0mm"]
[null,10.5,10.5,10.5,10.5,10.5,10.5,10.5,10.5,10.5,15.5,15.5,15.5,15.5,15.5,15.5,15.5]
[]
["Nylon Grade 1","2mm","3.0mm","4.0mm","5.0mm","6.0mm"]
[null,"E20","E28","E34","E39","E42"]
[]
["Nylon Grade 1","2mm","3.0mm","4.0mm","5.0mm","6.0mm"]
[null,10.5,10.5,10.5,10.5,10.5]
[]
["Zirconia","1.0mm","2mm","3.0mm","4.0mm","5.0mm","6.0mm","7.0mm","10.0mm"]
[null,"E10","E20","E28","E34","E39","E42","E45","E52"]
[]
["Zirconia","1.0mm","2mm","3.0mm","4.0mm","5.0mm","6.0mm","7.0mm","10.0mm"]
[null,10.5,10.5,10.5,10.5,10.5,10.5,10.5,15.5]
[]
["Copper Wire","2mm","3.0mm","4.0mm","5.0mm","6.0mm","7.0mm","8.0mm","9.0mm","10.0mm"]
[null,"E20","E28","E34","E39","E42","E45","E47","E49","E52"]
[]
["Copper Wire","2mm","3.0mm","4.0mm","5.0mm","6.0mm","7.0mm","8.0mm","9.0mm","10.0mm"]
[null,10.5,10.5,10.5,10.5,10.5,10.5,15.5,15.5,15.5]
[]
["Stainless Steel 316 Wire","3.0mm","4.0mm","5.0mm","8.0mm","9.0mm","10.0mm"]
[null,"E28","E34","E39","E47","E49","E52"]
[]
["Stainless Steel 316 Wire","3.0mm","4.0mm","5.0mm","8.0mm","9.0mm","10.0mm"]
[null,10.5,10.5,10.5,15.5,15.5,15.5]
[]
["Contaminant Type","Ferrous","Non Ferrous","316 St/St","304 St/St","Aluminium","Ph Bronze","Soda Lime","Crystal Glass","Teflon PTFE","Ceramic","Nylon Grade 1","Zirconia","316 St/St Wire"]
[null,"F01","F02","F03","F04","F07","F08","F09","F10","F11","F12","F13","F15","F16"]
[]
[]
[]
[]
["Test Stick - Standard Size","0.25mm","0.3mm","0.4mm","0.5mm","0.6mm","0.7mm","0.8mm","0.9mm","1.0mm","1.1mm","1.2mm","1.3mm","1.5mm","1.588mm","1.6mm","1.7mm","1.8mm","2mm","2.2mm","2.3mm","2.381mm","2.4mm","2.5mm","2.7mm","2.8mm","3.0mm","3.175mm","3.18mm","3.2mm","3.5mm","3.8mm","4.0mm","4.5mm","5.0mm","5.5mm","6.0mm","6.35mm","6.5mm","7.0mm","7.5mm","8.0mm","8.5mm","9.0mm","9.525mm","9.5mm","10.0mm","10.5mm","11.0mm","12.0mm","12.7mm","13.0mm","14.0mm","15.0mm","15.875mm","17.0mm","19.05mm","20.0mm","Ferrous","Non Ferrous","316 St/St","304 St/St","Aluminium","Ph Bronze","Soda Lime","Crystal Glass","Teflon PTFE","Ceramic","Nylon Grade 1","Zirconia","316 St/St Wire","Blue Hi Vis","Red Hi Vis","Green Hi Vis","Yellow Hi Vis","Blue Solid Colour ","Red Solid Colour ","Green Solid Colour ","Yellow Solid Colour "]
[null,"E01","E02","E04","E05","E06","E07","E08","E09","E10","E11","E12","E13","E15","E16","E17","E18","E19","E20","E21","E22","E23","E24","E25","E26","E27","E28","E29","E65","E30","E31","E32","E34","E35","E39","E40","E42","E43","E44","E45","E46","E47","E48","E49","E50","E51","E52","E53","E54","E55","E56","E57","E58","E59","E60","E61","E62","E63"]
[null,null,null,null,null,null,null,null,null,null,null,null,null,null,null,null,null,null,null,null,null,null,null,null,null,null,null,null,null,null,null,null,null,null,null,null,null,null,null,null,null,null,null,null,null,null,null,null,null,null,null,null,null,null,null,null,null,null,"F01","F02","F03","F04","F07","F08","F09","F10","F11","F12","F13","F15","F16"]
[null,null,null,null,null,null,null,null,null,null,null,null,null,null,null,null,null,null,null,null,null,null,null,null,null,null,null,null,null,null,null,null,null,null,null,null,null,null,null,null,null,null,null,null,null,null,null,null,null,null,null,null,null,null,null,null,null,null,null,null,null,null,null,null,null,null,null,null,null,null,null,"G60","G61","G62","G59","G71","G69","G72","G70"]
[]
["Test Stick - Standard Size","0.25mm","0.3mm","0.4mm","0.5mm","0.6mm","0.7mm","0.8mm","0.9mm","1.0mm","1.1mm","1.2mm","1.3mm","1.5mm","1.588mm","1.6mm","1.7mm","1.8mm","2mm","2.2mm","2.3mm","2.381mm","2.4mm","2.5mm","2.7mm","2.8mm","3.0mm","3.175mm","3.18mm","3.2mm","3.5mm","3.8mm","4.0mm","4.5mm","5.0mm","5.5mm","6.0mm","6.35mm","6.5mm","7.0mm","7.5mm","8.0mm","8.5mm","9.0mm","9.525mm","9.5mm","10.0mm","10.5mm","11.0mm","12.0mm","12.7mm","13.0mm","14.0mm","15.0mm","15.875mm","17.0mm","19.05mm","20.0mm"]
[null,10.5,10.5,10.5,10.5,10.5,10.5,10.5,10.5,10.5,10.5,10.5,10.5,10.5,10.5,10.5,10.5,10.5,10.5,10.5,10.5,10.5,10.5,10.5,10.5,10.5,10.5,10.5,10.5,10.5,10.5,10.5,10.5,10.5,10.5,10.5,10.5,10.5,10.5,10.5,15.5,15.5,15.5,15.5,15.5,15.5,15.5,15.5,15.5,15.5,15.5,15.5,15.5,15.5,28.5,28.5,28.5,28.5]
[]
["Test Stick - 200mm","0.25mm","0.3mm","0.4mm","0.5mm","0.6mm","0.7mm","0.8mm","0.9mm","1.0mm","1.1mm","1.2mm","1.3mm","1.5mm","1.588mm","1.6mm","1.7mm","1.8mm","2mm","2.2mm","2.3mm","2.381mm","2.4mm","2.5mm","2.7mm","2.8mm","3.0mm","3.175mm","3.18mm","3.2mm","3.5mm","3.8mm","4.0mm","4.5mm","5.0mm","5.5mm","6.0mm","6.35mm","6.5mm","7.0mm","7.5mm","8.0mm","8.5mm","9.0mm","9.525mm","9.5mm","10.0mm","10.5mm","11.0mm","12.0mm","12.7mm","13.0mm","14.0mm","15.0mm","15.875mm","17.0mm","19.05mm","20.0mm"]
[null,11.5,11.5,11.5,11.5,11.5,11.5,11.5,11.5,11.5,11.5,11.5,11.5,11.5,11.5,11.5,11.5,11.5,11.5,11.5,11.5,11.5,11.5,11.5,11.5,11.5,11.5,11.5,11.5,11.5,11.5,11.5,11.5,11.5,11.5,11.5,11.5,11.5,11.5,11.5,16.5,16.5,16.5,16.5,16.5,16.5,16.5,16.5,16.5,16.5,16.5,16.5,16.5,16.5,29.5,29.5,29.5,29.5]
[]
["Flexi Test Stick - Standard Size","0.25mm","0.3mm","0.4mm","0.5mm","0.6mm","0.7mm","0.8mm","0.9mm","1.0mm","1.1mm","1.2mm","1.3mm","1.5mm","1.588mm","1.6mm","1.7mm","1.8mm","2mm","2.2mm","2.3mm","2.381mm","2.4mm","2.5mm","2.7mm","2.8mm","3.0mm","3.175mm","3.18mm","3.2mm","3.5mm","3.8mm","4.0mm","4.5mm","5.0mm","5.5mm","6.0mm","6.35mm","6.5mm","7.0mm","7.5mm","8.0mm","8.5mm","9.0mm","9.525mm","9.5mm","10.0mm","10.5mm","11.0mm","12.0mm","12.7mm","13.0mm","14.0mm","15.0mm","15.875mm","17.0mm","19.05mm","20.0mm"]
[null,21.5,21.5,21.5,21.5,21.5,21.5,21.5,21.5,21.5,21.5,21.5,21.5,21.5,21.5,21.5,21.5,21.5,21.5,21.5,21.5,21.5,21.5,21.5,21.5,21.5,21.5,21.5,21.5,21.5,21.5,21.5,21.5,21.5,21.5,21.5,21.5,21.5,21.5,21.5,26.5,26.5,26.5,26.5,26.5,26.5,26.5,26.5,26.5,26.5,26.5,26.5,26.5,26.5,39.5,39.5,39.5,39.5]
[]
["Flexi Test Stick -200m","0.25mm","0.3mm","0.4mm","0.5mm","0.6mm","0.7mm","0.8mm","0.9mm","1.0mm","1.1mm","1.2mm","1.3mm","1.5mm","1.588mm","1.6mm","1.7mm","1.8mm","2mm","2.2mm","2.3mm","2.381mm","2.4mm","2.5mm","2.7mm","2.8mm","3.0mm","3.175mm","3.18mm","3.2mm","3.5mm","3.8mm","4.0mm","4.5mm","5.0mm","5.5mm","6.0mm","6.35mm","6.5mm","7.0mm","7.5mm","8.0mm","8.5mm","9.0mm","9.525mm","9.5mm","10.0mm","10.5mm","11.0mm","12.0mm","12.7mm","13.0mm","14.0mm","15.0mm","15.875mm","17.0mm","19.05mm","20.0mm"]
[null,22.5,22.5,22.5,22.5,22.5,22.5,22.5,22.5,22.5,22.5,22.5,22.5,22.5,22.5,22.5,22.5,22.5,22.5,22.5,22.5,22.5,22.5,22.5,22.5,22.5,22.5,22.5,22.5,22.5,22.5,22.5,22.5,22.5,22.5,22.5,22.5,22.5,22.5,22.5,27.5,27.5,27.5,27.5,27.5,27.5,27.5,27.5,27.5,27.5,27.5,27.5,27.5,27.5,40.5,40.5,40.5,40.5]
[]
[]
["Laminated Test Card","Standard","Standard Blue","Standard Red","Standard Lime Green","Standard Yellow"]
[null,"G55","G09","G20","G23","G19"]
[]
[]
["PTFE Test Stick","0.25mm","0.3mm","0.4mm","0.5mm","0.6mm","0.7mm","0.8mm","0.9mm","1.0mm","1.1mm","1.2mm","1.3mm","1.5mm","1.588mm","1.6mm","1.7mm","1.8mm","2mm","2.2mm","2.3mm","2.381mm","2.4mm","2.5mm","2.7mm","2.8mm","3.0mm","3.175mm","3.18mm","3.2mm","3.5mm","3.8mm","4.0mm","4.5mm","5.0mm","5.5mm","6.0mm","6.35mm","6.5mm","7.0mm","7.5mm","8.0mm","8.5mm","9.0mm","9.525mm","9.5mm","10.0mm","10.5mm","11.0mm","12.0mm","12.7mm","13.0mm","14.0mm","15.0mm","15.875mm","17.0mm","19.05mm","20.0mm"]
[null,11.5,11.5,11.5,11.5,11.5,11.5,11.5,11.5,11.5,11.5,11.5,11.5,11.5,11.5,11.5,11.5,11.5,11.5,11.5,11.5,11.5,11.5,11.5,11.5,11.5,11.5,11.5,11.5,11.5,11.5,11.5,11.5,11.5,11.5,11.5,11.5,11.5,11.5,11.5,16.5,16.5,16.5,16.5,16.5,16.5,16.5,16.5,16.5,16.5,16.5,16.5,16.5,16.5,29.5,29.5,29.5,29.5]
[]
[]
["Detectable Utility Clip","With Dual Clip","With Belt Clip"]
[null,"A95","A96"]
[]
["Tape Measure","Standard Tape","Heavy Duty Stainless Steel Tape"]
[null,"P01","P64"]
[]
["Tape Measure","Standard Tape","Heavy Duty Stainless Steel Tape"]
[null,14.95,19.95]
[]
["Detectable Stackable Trays","Tray complete with Lid","Tray Only","Lid Only","Blue","Red","Green","Yellow"]
[null,"A40","A208","A209"]
[null,null,null,null,"P01","P03","P04","P05"]
[]
["Detectable Stackable Trays","Tray complete with Lid","Tray Only","Lid Only"]
[null,17.989999999999998,12,5.99]
[]
["Cable Tie Mounts","3.1mm hole dia","4.0mm hole dia"]
[null,"S036","S037"]
[]
["Cable Tie Mounts","3.1mm hole dia","4.0mm hole dia"]
[null,32.67,35.39]
[]
["Non Detectable Stackable Trays","Tray complete with Lid","Tray Only","Lid Only","Blue","Red","Green","Yellow","Grey"]
[null,"A40","A208","A209"]
[null,null,null,null,"P01","P03","P04","P05","P11"]
[]
["Non Detectable Stackable Trays","Tray complete with Lid","Tray Only","Lid Only"]
[null,8.5,6.5,2.5]
[]
["Zip Ties","Length 4\" (101.6mm) , Tensile Strength 18lb","Length 8\" (203.2mm) , Tensile Strength 40lb","Length 7\" (177.8mm), Tensile Strength 50lb","Length11\" (279.4mm), Tensile Strength 50lb","Length14\" (355.6mm), Tensile Strength 50lb","Length 14\"(355.6mm), Tensile Strength 120lb"]
[null,"S593","S594","S595","S596","S597","S598"]
[]
["Zip Ties","Length 4\" (101.6mm) , Tensile Strength 18lb","Length 8\" (203.2mm) , Tensile Strength 40lb","Length 7\" (177.8mm), Tensile Strength 50lb","Length11\" (279.4mm), Tensile Strength 50lb","Length14\" (355.6mm), Tensile Strength 50lb","Length 14\"(355.6mm), Tensile Strength 120lb"]
[null,6.55,11.4,11.6,18.600000000000001,23.1,59.1]
[]
["Screw Mounts","#4 - Thread dia 0.11\"","#6  - Thread dia 0.13\"","#8 - Thread dia 0.16\"","#10 - Thread dia 0.19\"","#14 - Thread dia 0.24\""]
[null,"S599","S600","S621","S622","S623"]
[]
["Screw Mounts","#4 - Thread dia 0.11\"","#6  - Thread dia 0.13\"","#8 - Thread dia 0.16\"","#10 - Thread dia 0.19\"","#14 - Thread dia 0.24\""]
[null,8.6,8.3000000000000007,8.1,20.9,11.9]
[]
["Zip Tie Mounting Pad","1\" (25.4mm)","3/4\" (19.05mm)","1\" (25.4mm)  No Tape","3/4\" (19.05mm) No Tape"]
[null,"S426","S624","S625","S626"]
[]
["Zip Tie Mounting Pad","1\" (25.4mm)","3/4\" (19.05mm)","1\" (25.4mm)  No Tape","3/4\" (19.05mm) No Tape"]
[null,16.7,13.3,13.9,11]

{"sheet":"Instructions","index":2,"n_rows":2,"n_cols":1,"rows_kept":2,"cut":false,"hidden":false,"merged":[]}
["Instructions"]
["After opening this Order Form, please enter the quantity for each item.  \n\nA running total is calculated.   \n\nOnce you have completed your selections you have 2 options:\n-  Save the file and email it to sales@detectablematerials.com \n-  Save it as a PDF file and fax it to (908) 236-0278\n\nIf you have any questions please contact us at sales@detectablematerials.com OR call us at 1-844-564-9216"]