{"text_format":"1","workbook":"xlsx","n_sheets":3,"sheets":["Price List","Coding and Prices","Instructions"],"not_rendered":{"charts":0,"images":226,"macros":1,"external_links":0,"defined_names":3,"comments":0,"pivot_tables":0},"unopened":[],"bounds":{"document_bytes":16777216,"sheet_cells":100000,"rows_first":2000,"rows_last":500,"rows_between":2000,"halvings":0,"cell_chars":16384,"cell_head_chars":4096},"cells_cut":0,"cells_raw":0,"read":"whole","date_system":"1900"}

{"sheet":"Price List","index":0,"n_rows":1089,"n_cols":18,"rows_kept":1089,"cut":false,"hidden":false,"merged":[[460,16,461,16],[451,15,452,15],[494,17,495,17],[928,12,929,12],[928,13,929,13],[846,14,847,14],[849,10,850,10],[448,16,449,16],[433,11,434,11],[433,17,434,17],[457,17,458,17],[460,17,461,17],[463,17,464,17],[587,16,588,16],[578,9,579,9],[578,10,579,10],[578,11,579,11],[463,12,464,13],[491,14,492,14],[575,10,576,10],[515,9,516,9],[575,15,576,15],[575,17,576,17],[509,11,510,11],[463,9,464,9],[463,10,464,10],[575,13,576,13],[509,12,510,13],[515,15,516,15],[587,15,588,15],[460,11,461,11],[494,15,495,15],[494,16,495,16],[460,12,461,13],[460,14,461,14],[925,7,926,7],[925,13,926,13],[903,9,904,9],[903,10,904,10],[903,11,904,11],[903,12,904,12],[873,6,874,6],[873,7,874,7],[928,6,929,6],[928,7,929,7],[581,17,582,17],[587,14,588,14],[578,14,579,14],[578,15,579,15],[578,16,579,16],[578,17,579,17],[515,6,516,6],[599,17,600,17],[581,11,582,11],[629,10,630,10],[632,15,633,15],[928,10,929,10],[584,9,585,9],[632,6,633,6],[632,7,633,7],[632,8,633,8],[735,17,736,17],[626,17,627,17],[928,14,929,14],[928,15,929,15],[629,6,630,6],[928,11,929,11],[965,4,965,5],[982,4,982,5],[955,4,955,5],[956,4,956,5],[950,4,950,5],[951,4,951,5],[952,4,952,5],[953,4,953,5],[1012,1,1027,1],[1021,4,1021,5],[990,4,990,5],[855,14,856,14],[840,7,841,7],[843,13,844,13],[843,2,844,2],[843,5,844,5],[855,9,856,9],[855,10,856,10],[855,11,856,11],[977,4,977,5],[978,4,978,5],[979,4,979,5],[988,4,988,5],[855,3,856,3],[846,10,847,10],[870,11,871,11],[876,9,877,9],[876,11,877,11],[876,12,877,12],[876,13,877,13],[876,14,877,14],[925,6,926,6],[840,1,841,1],[840,2,841,2],[840,5,841,5],[859,1,860,1],[846,1,847,1],[855,1,856,1],[912,1,917,1],[919,1,923,1],[925,1,926,1],[903,2,904,2],[903,1,904,1],[857,1,857,5],[846,5,847,5],[852,1,853,1],[852,5,853,5],[903,3,904,3],[963,4,963,5],[943,1,958,1],[861,2,868,2],[928,1,929,1],[954,4,954,5],[873,2,874,2],[876,3,877,3],[878,1,878,5],[880,1,881,1],[909,1,910,1],[897,1,901,1],[873,1,874,1],[883,1,884,1],[961,4,961,5],[962,4,962,5],[1081,1,1081,5],[1066,1,1079,1],[1066,4,1066,5],[1067,4,1067,5],[1068,4,1068,5],[1069,4,1069,5],[1070,4,1070,5],[1071,4,1071,5],[1072,4,1072,5],[1073,4,1073,5],[1074,4,1074,5],[1075,4,1075,5],[1076,4,1076,5],[1077,4,1077,5],[1078,4,1078,5],[1079,4,1079,5],[1048,1,1061,1],[1065,4,1065,5],[1063,1,1063,17],[1052,4,1052,5],[1053,4,1053,5],[1054,4,1054,5],[873,17,874,17],[1030,1,1045,1],[1030,4,1030,5],[855,7,856,7],[855,8,856,8],[943,4,943,5],[944,4,944,5],[948,4,948,5],[843,9,844,9],[843,10,844,10],[843,1,844,1],[1049,4,1049,5],[1050,4,1050,5],[1051,4,1051,5],[1031,4,1031,5],[957,4,957,5],[930,1,930,5],[991,4,991,5],[1003,4,1003,5],[1002,4,1002,5],[1004,4,1004,5],[855,5,856,5],[964,4,964,5],[1034,4,1034,5],[1035,4,1035,5],[983,4,983,5],[977,1,992,1],[971,4,971,5],[972,4,972,5],[974,4,974,5],[989,4,989,5],[1005,4,1005,5],[846,6,847,6],[855,15,856,15],[855,17,856,17],[852,17,853,17],[846,17,847,17],[849,17,850,17],[846,7,847,7],[846,15,847,15],[855,16,856,16],[852,3,853,3],[852,16,853,16],[843,6,844,6],[1061,4,1061,5],[928,8,929,8],[928,9,929,9],[1041,4,1041,5],[1047,4,1047,5],[1048,4,1048,5],[1056,4,1056,5],[1057,4,1057,5],[1058,4,1058,5],[1059,4,1059,5],[1060,4,1060,5],[1055,4,1055,5],[984,4,984,5],[985,4,985,5],[986,4,986,5],[987,4,987,5],[949,4,949,5],[928,16,929,16],[928,17,929,17],[843,15,844,15],[771,14,772,14],[498,17,499,17],[765,3,766,3],[765,13,766,13],[759,3,760,3],[759,6,760,6],[812,15,813,15],[846,11,847,11],[846,13,847,13],[859,6,860,6],[859,7,860,7],[859,8,860,8],[859,9,860,9],[859,10,860,10],[859,11,860,11],[859,12,860,13],[859,14,860,14],[859,15,860,15],[859,16,860,16],[855,13,856,13],[849,9,850,9],[849,8,850,8],[818,6,819,6],[818,7,819,7],[818,8,819,8],[821,7,822,7],[821,8,822,8],[852,9,853,9],[855,6,856,6],[821,12,822,13],[821,6,822,6],[840,6,841,6],[410,16,411,16],[417,17,418,17],[371,16,372,16],[393,17,394,17],[150,1,151,1],[150,6,151,6],[198,1,199,1],[281,15,282,15],[195,2,196,2],[390,14,391,14],[299,14,300,14],[454,15,455,15],[296,12,297,12],[284,13,285,13],[281,13,282,13],[584,8,585,8],[590,9,591,9],[587,9,588,9],[581,9,582,9],[500,13,501,13],[500,11,501,11],[454,12,455,13],[515,16,516,16],[575,9,576,9],[466,17,467,17],[581,15,582,15],[421,11,422,11],[575,11,576,11],[500,10,501,10],[500,17,501,17],[498,8,499,8],[502,11,503,11],[840,15,841,15],[840,9,841,9],[840,10,841,10],[840,11,841,11],[840,13,841,13],[837,17,838,17],[840,16,841,16],[824,14,825,14],[818,9,819,9],[818,10,819,10],[818,11,819,11],[815,9,816,9],[833,14,834,14],[818,17,819,17],[833,13,834,13],[840,17,841,17],[824,16,825,16],[815,11,816,11],[840,14,841,14],[837,15,838,15],[815,10,816,10],[774,15,775,15],[738,15,739,15],[824,8,825,8],[812,14,813,14],[794,11,795,11],[794,12,795,13],[794,14,795,14],[812,8,813,8],[753,15,754,15],[762,8,763,8],[765,10,766,10],[765,15,766,15],[762,15,763,15],[759,15,760,15],[759,8,760,8],[741,14,742,14],[762,12,763,12],[747,14,748,14],[756,8,757,8],[756,9,757,9],[756,10,757,10],[815,8,816,8],[738,8,739,8],[780,12,781,12],[780,14,781,14],[780,15,781,15],[785,1,785,17],[786,2,786,3],[783,16,784,16],[780,16,781,16],[786,6,786,17],[765,17,766,17],[711,8,712,8],[806,17,807,17],[759,7,760,7],[626,1,627,1],[626,3,627,3],[629,1,630,1],[629,3,630,3],[629,5,630,5],[629,7,630,7],[629,8,630,8],[629,9,630,9],[732,1,733,1],[753,17,754,17],[774,14,775,14],[741,16,742,16],[593,16,594,16],[632,5,633,5],[629,11,630,11],[768,17,769,17],[768,8,769,8],[768,9,769,9],[768,10,769,10],[768,11,769,11],[768,12,769,12],[611,17,612,17],[738,1,739,1],[735,1,736,1],[762,17,763,17],[762,16,763,16],[762,13,763,13],[762,11,763,11],[708,3,709,3],[708,6,709,6],[720,9,721,9],[717,9,718,9],[714,10,715,10],[738,6,739,6],[735,2,736,2],[762,3,763,3],[726,6,727,6],[729,6,730,6],[694,15,695,15],[694,17,695,17],[717,17,718,17],[717,13,718,13],[717,11,718,11],[720,16,721,16],[717,6,718,6],[705,9,706,9],[720,6,721,6],[729,2,730,2],[708,12,709,13],[697,2,699,2],[729,12,730,12],[714,6,715,6],[714,7,715,7],[714,8,715,8],[714,9,715,9],[729,7,730,7],[714,17,715,17],[762,9,763,9],[705,12,706,12],[705,13,706,13],[694,6,695,6],[726,1,727,1],[705,6,706,6],[708,1,709,1],[711,3,712,3],[726,2,727,2],[701,1,703,1],[701,2,703,2],[685,8,686,8],[699,4,699,5],[717,1,718,1],[717,2,718,2],[691,7,692,7],[723,1,724,1],[705,2,706,2],[720,2,721,2],[694,3,695,3],[694,10,695,10],[697,1,699,1],[720,1,721,1],[723,2,724,2],[705,7,706,7],[714,1,715,1],[714,2,715,2],[702,4,702,5],[703,4,703,5],[685,1,686,1],[688,1,689,1],[714,3,715,3],[698,4,698,5],[691,2,692,2],[691,6,692,6],[708,7,709,7],[694,1,695,1],[660,1,661,1],[694,7,695,7],[666,7,667,7],[688,10,689,10],[688,9,689,9],[694,2,695,2],[688,3,689,3],[688,6,689,6],[691,1,692,1],[629,13,630,13],[632,9,633,9],[632,11,633,11],[578,7,579,7],[578,8,579,8],[685,6,686,6],[682,6,683,6],[675,1,676,1],[688,11,689,11],[691,11,692,11],[679,11,680,11],[679,9,680,9],[663,10,664,10],[666,10,667,10],[638,9,639,9],[623,11,624,11],[623,13,624,13],[620,8,621,8],[632,1,633,1],[632,3,633,3],[626,8,627,8],[626,9,627,9],[672,1,673,1],[657,1,658,1],[669,1,670,1],[651,1,652,1],[638,1,639,1],[623,1,624,1],[638,6,639,6],[654,1,655,1],[657,9,658,9],[657,6,658,6],[642,7,643,7],[660,15,661,15],[635,1,636,1],[679,1,680,1],[663,1,664,1],[663,6,664,6],[663,7,664,7],[666,1,667,1],[638,2,639,2],[666,2,667,2],[666,8,667,8],[672,6,673,6],[660,3,661,3],[651,8,652,8],[677,1,677,5],[669,6,670,6],[640,1,640,5],[679,14,680,14],[682,1,683,1],[685,3,686,3],[509,9,510,9],[611,10,612,10],[575,3,576,3],[590,13,591,13],[578,13,579,13],[632,13,633,13],[491,11,492,11],[705,1,706,1],[732,3,733,3],[723,6,724,6],[723,7,724,7],[723,8,724,8],[717,7,718,7],[717,8,718,8],[711,6,712,6],[711,7,712,7],[688,8,689,8],[726,8,727,8],[711,1,712,1],[711,2,712,2],[666,9,667,9],[708,8,709,8],[708,9,709,9],[694,12,695,13],[720,8,721,8],[720,7,721,7],[626,10,627,10],[626,11,627,11],[626,13,627,13],[596,13,597,13],[694,8,695,8],[669,2,670,2],[679,2,680,2],[502,13,503,13],[691,3,692,3],[682,3,683,3],[642,9,643,9],[688,7,689,7],[651,2,652,2],[669,3,670,3],[651,3,652,3],[675,8,676,8],[623,6,624,6],[648,6,649,6],[682,7,683,7],[654,6,655,6],[675,6,676,6],[635,5,636,5],[635,6,636,6],[578,3,579,3],[596,6,597,6],[605,11,606,11],[590,11,591,11],[638,7,639,7],[679,6,680,6],[679,7,680,7],[512,10,513,10],[654,7,655,7],[654,8,655,8],[660,7,661,7],[651,6,652,6],[660,6,661,6],[620,3,621,3],[617,6,618,6],[587,11,588,11],[605,13,606,13],[590,10,591,10],[620,11,621,11],[590,1,591,1],[614,1,615,1],[468,1,468,5],[491,1,492,1],[614,13,615,13],[614,7,615,7],[587,13,588,13],[617,5,618,5],[553,1,573,1],[575,8,576,8],[578,2,579,2],[498,13,499,13],[581,8,582,8],[587,2,588,2],[500,8,501,8],[620,10,621,10],[515,12,516,13],[581,13,582,13],[491,12,492,13],[614,6,615,6],[587,10,588,10],[512,11,513,11],[500,16,501,16],[357,12,358,13],[357,14,358,14],[454,16,455,16],[457,11,458,11],[515,8,516,8],[515,1,516,1],[457,7,458,7],[494,9,495,9],[491,7,492,7],[491,8,492,8],[515,11,516,11],[515,10,516,10],[463,16,464,16],[445,16,446,16],[466,15,467,15],[433,15,434,15],[448,15,449,15],[454,14,455,14],[357,15,358,15],[383,16,384,16],[390,15,391,15],[463,14,464,14],[494,11,495,11],[466,3,467,3],[491,6,492,6],[512,14,513,14],[502,16,503,16],[509,16,510,16],[491,15,492,15],[466,8,467,8],[509,6,510,6],[424,17,425,17],[419,17,420,17],[448,17,449,17],[354,17,355,17],[357,17,358,17],[451,16,452,16],[451,17,452,17],[451,14,452,14],[439,15,440,15],[421,15,422,15],[413,16,414,16],[502,10,503,10],[463,8,464,8],[512,1,513,1],[502,8,503,8],[498,10,499,10],[498,9,499,9],[502,6,503,6],[512,6,513,6],[502,7,503,7],[457,6,458,6],[509,8,510,8],[502,9,503,9],[500,9,501,9],[512,2,513,2],[474,4,474,5],[466,6,467,6],[494,7,495,7],[491,3,492,3],[410,13,411,13],[494,10,495,10],[498,6,499,6],[584,17,585,17],[599,14,600,14],[605,17,606,17],[602,16,603,16],[596,11,597,11],[584,16,585,16],[584,15,585,15],[599,9,600,9],[584,14,585,14],[688,17,689,17],[669,11,670,11],[614,16,615,16],[635,17,636,17],[645,17,646,17],[593,9,594,9],[648,10,649,10],[675,15,676,15],[593,10,594,10],[617,9,618,9],[651,16,652,16],[617,15,618,15],[590,17,591,17],[614,17,615,17],[602,14,603,14],[584,13,585,13],[590,16,591,16],[608,13,609,13],[651,17,652,17],[596,16,597,16],[669,14,670,14],[599,15,600,15],[651,12,652,13],[587,17,588,17],[599,13,600,13],[645,12,646,13],[623,7,624,7],[648,7,649,7],[596,9,597,9],[614,9,615,9],[651,7,652,7],[648,17,649,17],[617,7,618,7],[642,8,643,8],[611,16,612,16],[587,8,588,8],[596,7,597,7],[596,8,597,8],[614,15,615,15],[638,10,639,10],[651,10,652,10],[611,7,612,7],[593,15,594,15],[602,9,603,9],[642,14,643,14],[642,15,643,15],[638,13,639,13],[593,11,594,11],[642,6,643,6],[657,12,658,13],[614,14,615,14],[648,1,649,1],[648,2,649,2],[635,9,636,9],[602,11,603,11],[602,13,603,13],[620,15,621,15],[611,15,612,15],[596,14,597,14],[648,3,649,3],[635,10,636,10],[623,10,624,10],[648,11,649,11],[632,10,633,10],[626,5,627,5],[642,1,643,1],[648,9,649,9],[623,8,624,8],[611,8,612,8],[608,1,609,1],[605,1,606,1],[608,5,609,5],[611,1,612,1],[608,8,609,8],[638,5,639,5],[635,3,636,3],[645,15,646,15],[623,15,624,15],[620,7,621,7],[623,9,624,9],[623,3,624,3],[626,15,627,15],[660,16,661,16],[638,17,639,17],[688,12,689,13],[675,9,676,9],[679,10,680,10],[663,12,664,13],[660,11,661,11],[660,12,661,13],[660,17,661,17],[654,17,655,17],[679,15,680,15],[672,12,673,13],[657,11,658,11],[657,10,658,10],[685,16,686,16],[672,10,673,10],[672,11,673,11],[685,9,686,9],[623,5,624,5],[685,7,686,7],[682,9,683,9],[666,14,667,14],[669,12,670,13],[651,14,652,14],[682,8,683,8],[672,7,673,7],[672,8,673,8],[651,9,652,9],[654,14,655,14],[654,12,655,13],[648,16,649,16],[648,14,649,14],[608,17,609,17],[436,17,437,17],[415,17,416,17],[590,15,591,15],[502,17,503,17],[491,17,492,17],[442,15,443,15],[442,17,443,17],[515,17,516,17],[608,15,609,15],[575,14,576,14],[599,16,600,16],[620,17,621,17],[575,16,576,16],[620,16,621,16],[512,17,513,17],[502,15,503,15],[498,15,499,15],[512,15,513,15],[632,16,633,16],[626,14,627,14],[608,14,609,14],[645,14,646,14],[515,14,516,14],[500,14,501,14],[581,14,582,14],[427,17,428,17],[629,17,630,17],[638,14,639,14],[590,14,591,14],[602,5,603,5],[602,6,603,6],[602,7,603,7],[602,8,603,8],[608,7,609,7],[599,2,600,2],[599,6,600,6],[599,7,600,7],[614,8,615,8],[605,6,606,6],[605,7,606,7],[605,8,606,8],[611,4,611,5],[612,4,612,5],[605,5,606,5],[602,2,603,2],[611,6,612,6],[602,1,603,1],[608,6,609,6],[614,5,615,5],[623,2,624,2],[617,1,618,1],[620,5,621,5],[620,6,621,6],[620,1,621,1],[626,6,627,6],[626,7,627,7],[638,8,639,8],[454,2,455,2],[519,1,551,1],[596,1,597,1],[581,6,582,6],[599,8,600,8],[593,7,594,7],[575,6,576,6],[575,7,576,7],[587,1,588,1],[590,2,591,2],[590,6,591,6],[590,7,591,7],[590,8,591,8],[587,7,588,7],[599,1,600,1],[599,5,600,5],[593,6,594,6],[593,8,594,8],[584,1,585,1],[578,1,579,1],[584,6,585,6],[581,1,582,1],[581,7,582,7],[593,1,594,1],[578,5,579,5],[466,7,467,7],[578,6,579,6],[575,1,576,1],[584,7,585,7],[500,2,501,2],[500,7,501,7],[509,2,510,2],[500,6,501,6],[500,4,501,5],[498,2,499,2],[502,2,503,2],[491,10,492,10],[509,7,510,7],[498,7,499,7],[509,1,510,1],[480,2,481,2],[478,2,479,2],[466,2,467,2],[466,9,467,9],[470,1,489,1],[587,6,588,6],[515,7,516,7],[512,7,513,7],[497,1,507,1],[463,3,464,3],[460,10,461,10],[466,1,467,1],[442,6,443,6],[494,8,495,8],[448,1,449,1],[454,8,455,8],[454,9,455,9],[454,6,455,6],[454,7,455,7],[454,1,455,1],[451,1,452,1],[445,1,446,1],[445,6,446,6],[445,7,446,7],[473,4,473,5],[445,2,446,2],[466,10,467,10],[442,1,443,1],[457,3,458,3],[448,9,449,9],[445,10,446,10],[448,10,449,10],[445,8,446,8],[448,8,449,8],[390,6,391,6],[341,6,342,6],[363,7,364,7],[380,7,381,7],[386,6,387,6],[371,7,372,7],[338,6,339,6],[439,6,440,6],[433,3,434,3],[460,7,461,7],[494,1,495,1],[442,8,443,10],[460,8,461,8],[491,9,492,9],[457,1,458,1],[457,2,458,2],[494,3,495,3],[494,6,495,6],[460,1,461,1],[472,4,472,5],[460,2,461,2],[460,6,461,6],[463,1,464,1],[463,2,464,2],[463,6,464,6],[463,7,464,7],[448,2,449,2],[439,9,440,9],[436,10,437,10],[471,4,471,5],[451,2,452,2],[451,6,452,6],[383,7,384,7],[421,7,422,7],[393,2,394,2],[383,6,384,6],[344,1,345,1],[344,7,345,7],[354,1,355,1],[436,15,437,15],[424,15,425,15],[419,9,420,9],[415,11,416,11],[413,13,414,13],[419,16,420,16],[421,16,422,16],[415,16,416,16],[417,16,418,16],[436,16,437,16],[430,15,431,15],[371,14,372,14],[371,12,372,13],[399,10,400,10],[399,14,400,14],[399,11,400,11],[344,16,345,16],[347,16,348,16],[399,16,400,16],[413,15,414,15],[427,15,428,15],[430,14,431,14],[433,14,434,14],[393,14,394,14],[396,15,397,15],[417,2,418,2],[433,1,434,1],[430,2,431,2],[430,1,431,1],[427,1,428,1],[421,3,422,3],[433,2,434,2],[413,7,414,7],[417,13,418,13],[421,13,422,13],[433,12,434,13],[436,12,437,13],[415,13,416,13],[430,12,431,12],[430,13,431,13],[436,8,437,8],[427,12,428,13],[424,7,425,7],[415,8,416,8],[430,11,431,11],[433,9,434,9],[433,10,434,10],[419,2,420,2],[419,6,420,6],[413,3,414,3],[415,2,416,2],[407,3,407,4],[402,2,402,3],[386,9,387,9],[451,8,452,8],[419,8,420,8],[439,8,440,8],[451,9,452,9],[451,10,452,10],[413,1,422,1],[448,6,449,6]],"merged_total":3261,"flags":["merged_cut"]}
[]
[]
[]
[]
[]
[]
[]
[]
[]
[]
[null,"How to order?",null,"Name (First and last):"]
[null,"Fill out this form, save it to your computer and email back to sales@detectablematerials.com",null,"Date:"]
[null,null,null,"Store#:"]
[null,null,null,"Number#:"]
[]
[null,"Stationary Range"]
[null,"DETECTAMET PEN RANGE\nElephant Pens \nHD Pens\nOne Piece Pens\nEconomy Pen\nPen Refills\nMetal Case Pens\nTouch Screen Pen\nStylus\n\n\n","Marker & Highlighter Pen Range\nMarker Pen Range\nRetractable - Whiteboard Marker \nRetractable - Permanent Marker\nNon Retractable - Whiteboard Marker\nNon Retractable - Permanent Marker\nFine Tip Marker Pen\n\nHighlighter Pen Range\nRetractable - Chisel Tip Highlighter \nNon Retractable - Chisel Tip Highlighter\n",null,"Detectable Clipboard Range\nClipboard Range\nColour Coded Clipboard Range\nRing Binder Clipboards",null,"Office Equipment\nCalculators                                       Paperclip\nStapless Stapler                             Scissors\nID Badge Holder                             Ruler\nLanyards                                            Split Ring/Safety Chain\nGrip Pen Sleeve                             Document Fastener\nPen Holder                                       Whiteboard Film\nMetal Detectable Paper             Paper Holder\n"]
[]
[]
[null,"Create Your Own - These options are customisable and will create your code and purchase price for you",null,null,null,null,null,null,null,null,null,null,null,null,"Unit Per Pack","Running Total",{"$f":"SUM(R20:R927)","v":0}]
[]
[null,null,null,null,null,null,"Product Code",null,null,null,null,null,null,null,null,"Quantity","Price","Total"]
[null,"Retractable Pen Type","Ink","Housing","End Cap","Attachment"]
[null,"HD Retractable","Blue","Blue Housing","Blue End","With Clip",101,"-",{"$f":"HLOOKUP(C24,'Coding and Prices'!D1:N3,3,0)","v":"I01"},"-",{"$f":"HLOOKUP(D24,'Coding and Prices'!P1:X4,4,0)","v":"C1"},{"$f":"HLOOKUP(E24,'Coding and Prices'!Y1:AG5,5,0)","v":1},"-",{"$f":"HLOOKUP(F24,'Coding and Prices'!AH1:AJ6,6,0)","v":"PA01"},50,null,{"$f":"((INDEX('Coding and Prices'!A8:M10, MATCH(B24,'Coding and Prices'!A8:A10,0), MATCH(C24,'Coding and Prices'!A8:M8,0))))*1.06","v":72.61},{"$f":"Q24*P24","v":0}]
[null,"Elephant Retractable","Blue","Blue Housing","Blue End","With Clip",104,"-",{"$f":"HLOOKUP(C25,'Coding and Prices'!D1:N3,3,0)","v":"I01"},"-",{"$f":"HLOOKUP(D25,'Coding and Prices'!P1:X4,4,0)","v":"C1"},{"$f":"HLOOKUP(E25,'Coding and Prices'!Y1:AG5,5,0)","v":1},"-",{"$f":"HLOOKUP(F25,'Coding and Prices'!AH1:AJ6,6,0)","v":"PA01"},50,null,{"$f":"((INDEX('Coding and Prices'!A8:M10, MATCH(B25,'Coding and Prices'!A8:A10,0), MATCH(C25,'Coding and Prices'!A8:M8,0))))*1.06","v":64.66},0]
[]
[null,"Stick Pen Type","Ink","Housing","Attachment"]
[null,"HD Stick","Blue","Blue Housing","With Clip",null,106,"-",{"$f":"HLOOKUP(C28,'Coding and Prices'!A12:G14,3,0)","v":"I01"},"-",{"$f":"HLOOKUP(D28,'Coding and Prices'!A12:P15,4,0)","v":"C101"},null,"-",{"$f":"HLOOKUP(E28,'Coding and Prices'!A12:S16,5,0)","v":"PA01"},50,null,{"$f":"((VLOOKUP(B28,'Coding and Prices'!A18:B20,2,0)))*1.06","v":42.400000000000006},{"$f":"Q28*P28","v":0}]
[null,"Elephant Stick","Blue","Blue Housing","With Clip",null,{"$f":"INDEX('Coding and Prices'!A12:S16, MATCH(B27,'Coding and Prices'!A12:A16,0), MATCH(B29,'Coding and Prices'!A12:S12,0))","v":105},"-",{"$f":"INDEX('Coding and Prices'!A12:S16, MATCH(D27,'Coding and Prices'!A12:A16,0), MATCH(D29,'Coding and Prices'!A12:S12,0))","v":"C101"},"-",{"$f":"INDEX('Coding and Prices'!A12:S16, MATCH(C27,'Coding and Prices'!A12:A16,0), MATCH(C29,'Coding and Prices'!A12:S12,0))","v":"I01"},null,"-",{"$f":"INDEX('Coding and Prices'!A12:S16, MATCH(E27,'Coding and Prices'!A12:A16,0), MATCH(E29,'Coding and Prices'!A12:S12,0))","v":"PA01"},50,null,{"$f":"((VLOOKUP(B29,'Coding and Prices'!A19:B20,2,0)))*1.06","v":37.1},{"$f":"Q29*P29","v":0}]
[]
[null,"Metal Case Pen","Ink","Attachment",null,null,null,"115M",null,"-",{"$f":"HLOOKUP(C32,'Coding and Prices'!A22:P23,2,0)","v":"I01"},"-",{"$f":"HLOOKUP(D32,'Coding and Prices'!B22:P24,3,0)","v":"PA05"},null,50,null,{"$f":"((INDEX('Coding and Prices'!A26:M29, MATCH(D32,'Coding and Prices'!A26:A29,0), MATCH(C32,'Coding and Prices'!A26:M26,0))))*1.06","v":95.93},{"$f":"P31*Q31","v":0}]
[null,null,"Blue","Standard (No Clip)"]
[]
[null,"Stainless Steel Pen Type","Ink",null,null,null,null,null,{"$f":"HLOOKUP(B35,'Coding and Prices'!A31:C33,2,0)","v":113},"-","A05","-",{"$f":"HLOOKUP(C35,'Coding and Prices'!A31:O33,3,0)","v":"I01"},null,10,null,{"$f":"((INDEX('Coding and Prices'!A35:M37, MATCH(B35,'Coding and Prices'!A35:A37,0), MATCH(C35,'Coding and Prices'!A35:M35,0)))*1.85)*1.06","v":39.22},{"$f":"P34*Q34","v":0}]
[null,"Stainless Steel Managers Pen","Blue"]
[]
[null,"SP Stick Pen","Ink",null,null,null,null,null,119,"-",{"$f":"HLOOKUP(C38,'Coding and Prices'!D18:H19,2,0)","v":"I01"},"-","PA02",null,100,null,93.28,{"$f":"P37*Q37","v":0}]
[null,null,"Blue"]
[]
[null,"Economy Retractable Pen","Ink",null,null,null,null,null,125,"-","PA01","-",{"$f":"HLOOKUP(C41,'Coding and Prices'!D18:H19,2,0)","v":"I01"},null,50,null,44.122500000000002,{"$f":"P40*Q40","v":0}]
{"$rows_left_out":1050}
{"sheet":"Coding and Prices","index":1,"n_rows":1493,"n_cols":79,"rows_kept":1493,"cut":false,"hidden":false,"merged":[]}
[null,"HD Retractable","Elephant Retractable","Blue","Black","Red","Green","Blue Gel","Black Gel","Red Gel","Green Gel","Blue Cryo","Black Cryo","Blue Fine Tip","Black Fine Tip","Blue Housing","Black Housing","Red Housing","Green Housing","Yellow Housing","White Housing","Purple Housing","Orange Housing","Pink Housing","Blue End","Black End","Red End","Green End","Yellow End","White End","Purple End","Orange End","Pink End","With Clip","Without Clip","With Lanyard Attachment"]
["Retractable Pen Type",101,104]
["Ink",null,null,"I01","I02","I03","I04","I21","I22","I23","I24","I11","I12","I31","I32"]
["Housing",null,null,null,null,null,null,null,null,null,null,null,null,null,null,"C1","C2","C3","C4","C5","C6","C7","C8","C9"]
["End Cap",null,null,null,null,null,null,null,null,null,null,null,null,null,null,null,null,null,null,null,null,null,null,null,1,2,3,4,5,6,7,8,9]
["Attachment",null,null,null,null,null,null,null,null,null,null,null,null,null,null,null,null,null,null,null,null,null,null,null,null,null,null,null,null,null,null,null,null,"PA01","PA02","PA03"]
[]
["Pen Type","Blue","Black","Red","Green","Blue Gel","Black Gel","Red Gel","Green Gel","Blue Cryo","Black Cryo","Blue Fine Tip","Black Fine Tip"]
["Elephant Retractable",61,61,61,61,127.5,127.5,127.5,127.5,150,150,116.5,116.5]
["HD Retractable",68.5,68.5,68.5,68.5,142.5,142.5,142.5,142.5,162,162,137,137]
[]
[null,"HD Stick","Elephant Stick","Blue","Black","Red","Green","Blue Housing","Black Housing","Red Housing","Green Housing","Yellow Housing","White Housing","Purple Housing","Orange Housing","Pink Housing","With Clip","Without Clip","With Lanyard Attachment"]
["Stick Pen Type",116,105]
["Ink",null,null,"I01","I02","I03","I04"]
["Housing",null,null,null,null,null,null,"C101","C110","C103","C104","C105","C160","C107","C108","C109"]
["Attachment",null,null,null,null,null,null,null,null,null,null,null,null,null,null,null,"PA01","PA02","PA03"]
[]
["Pen Type","Price",null,"Pen Type","Blue","Black","Red","Green",null,"Marker Pen Type","Food Marker","Meat Marker","Blue","Red"]
["Elephant Stick",35,null,"SP Stick Pen","I01","I02","I03","I04",null,"Marker Type","T040","T041"]
["HD Stick",40,null,null,null,null,null,null,null,"Ink",null,null,"P01","P03"]
[]
[null,"Standard (No Clip)","With Split Ring","With Pocket Clip","Blue","Black","Red","Green","Blue Gel","Black Gel","Red Gel","Green Gel","Blue Cryo","Black Cryo","Blue Fine Tip","Black Fine Tip"]
["Ink",null,null,null,"I01","I02","I03","I04","I21","I22","I23","I24","I11","I12","I31","I32"]
["Attachment","PA05","PA04","PA01"]
[]
["Pen Type","Blue","Black","Red","Green","Blue Gel","Black Gel","Red Gel","Green Gel","Blue Cryo","Black Cryo","Blue Fine Tip","Black Fine Tip"]
["Standard (No Clip)",90.5,90.5,90.5,90.5,174,174,174,174,188.5,188.5,157.5,157.5]
["With Split Ring",102,102,102,102,174,174,174,174,188.5,188.5,157.5,157.5]
["With Pocket Clip",102,102,102,102,174,174,174,174,188.5,188.5,157.5,157.5]
[]
[null,"Stainless Steel Pen","Stainless Steel Managers Pen","Blue","Black","Red","Green","Blue Gel","Black Gel","Red Gel","Green Gel","Blue Cryo","Black Cryo","Blue Fine Tip","Black Fine Tip"]
["Pen Type",114,113]
["Ink",null,null,"I01","I02","I03","I04","I21","I22","I23","I24","I11","I12","I31","I32"]
[]
["Pen Type","Blue","Black","Red","Green","Blue Gel","Black Gel","Red Gel","Green Gel","Blue Cryo","Black Cryo","Blue Fine Tip","Black Fine Tip"]
["Stainless Steel Pen",18,18,18,18,22.5,22.5,22.5,22.5,27.5,27.5,21,21]
["Stainless Steel Managers Pen",20,20,20,20,24,24,24,24,36,36,27.5,27.5]
[]
[null,"Whiteboard Marker","Permanent Marker","Retractable","Non Retractable","Blue","Black","Red","Green","Bullet Tip","Chisel Tip"]
["Marker Pen Type",145,146]
{"$rows_left_out":1454}
{"sheet":"Instructions","index":2,"n_rows":2,"n_cols":1,"rows_kept":2,"cut":false,"hidden":false,"merged":[]}
["Instructions"]
["After opening this Order Form, please enter the quantity for each item.  \n\nA running total is calculated.   \n\nOnce you have completed your selections you have 2 options:\n-  Save the file and email it to sales@detectablematerials.com \n-  Save it as a PDF file and fax it to (908) 236-0278\n\nIf you have any questions please contact us at sales@detectablematerials.com OR call us at 1-844-564-9216"]